﻿2026-08-18T01:22:50.1879693Z Current runner version: '2.336.0'
2026-08-18T01:22:50.1884901Z Runner name: 'hfenduleam'
2026-08-18T01:22:50.1885413Z Runner group name: 'Default'
2026-08-18T01:22:50.1885957Z Machine name: 'HFENDULEAM'
2026-08-18T01:22:50.1889447Z ##[group]GITHUB_TOKEN Permissions
2026-08-18T01:22:50.1891198Z Actions: write
2026-08-18T01:22:50.1891555Z ArtifactMetadata: write
2026-08-18T01:22:50.1891896Z Attestations: write
2026-08-18T01:22:50.1892242Z Checks: write
2026-08-18T01:22:50.1892550Z CodeQuality: write
2026-08-18T01:22:50.1892876Z Contents: write
2026-08-18T01:22:50.1893207Z CopilotRequests: write
2026-08-18T01:22:50.1893535Z Deployments: write
2026-08-18T01:22:50.1893879Z Discussions: write
2026-08-18T01:22:50.1894209Z Drives: write
2026-08-18T01:22:50.1894529Z Issues: write
2026-08-18T01:22:50.1894884Z Metadata: read
2026-08-18T01:22:50.1895201Z Models: read
2026-08-18T01:22:50.1895514Z Packages: write
2026-08-18T01:22:50.1895838Z Pages: write
2026-08-18T01:22:50.1896486Z PullRequests: write
2026-08-18T01:22:50.1896963Z RepositoryProjects: write
2026-08-18T01:22:50.1897307Z SecurityEvents: write
2026-08-18T01:22:50.1897636Z Statuses: write
2026-08-18T01:22:50.1897974Z VulnerabilityAlerts: read
2026-08-18T01:22:50.1898359Z ##[endgroup]
2026-08-18T01:22:50.1899811Z Secret source: Actions
2026-08-18T01:22:50.1900551Z Prepare workflow directory
2026-08-18T01:22:50.2298049Z Prepare all required actions
2026-08-18T01:22:50.2343803Z Getting action download info
2026-08-18T01:22:50.5425967Z Download action repository 'actions/checkout@v5' (SHA:fbc6f3992d24b796d5a048ff273f7fcc4a7b6c09)
2026-08-18T01:22:51.4773507Z Complete job name: unit (self-hosted, Windows, hfenduleam)
2026-08-18T01:22:51.5644881Z ##[group]Run $floorBytes = 32GB
2026-08-18T01:22:51.5645817Z [36;1m$floorBytes = 32GB[0m
2026-08-18T01:22:51.5646566Z [36;1m$drive = (Get-Item $env:GITHUB_WORKSPACE).PSDrive[0m
2026-08-18T01:22:51.5647470Z [36;1m$freeBytes = [int64]$drive.Free[0m
2026-08-18T01:22:51.5648549Z [36;1mWrite-Host "disk preflight: drive=$($drive.Root) free_bytes=$freeBytes floor_bytes=$floorBytes"[0m
2026-08-18T01:22:51.5649744Z [36;1mif ($freeBytes -lt $floorBytes) {[0m
2026-08-18T01:22:51.5650913Z [36;1m  Write-Error "RESOURCE=disk drive=$($drive.Root) free_bytes=$freeBytes floor_bytes=$floorBytes"[0m
2026-08-18T01:22:51.5652040Z [36;1m  exit 1[0m
2026-08-18T01:22:51.5652558Z [36;1m}[0m
2026-08-18T01:22:51.5663427Z shell: C:\Program Files\PowerShell\7\pwsh.EXE -command ". '{0}'"
2026-08-18T01:22:51.5664176Z ##[endgroup]
2026-08-18T01:22:51.9601069Z disk preflight: drive=C:\ free_bytes=101600579584 floor_bytes=34359738368
2026-08-18T01:22:52.0782761Z ##[group]Run actions/checkout@v5
2026-08-18T01:22:52.0783583Z with:
2026-08-18T01:22:52.0784169Z   repository: BigscreenVR/spt-bs-core
2026-08-18T01:22:52.0792631Z   token: ***
2026-08-18T01:22:52.0793165Z   ssh-strict: true
2026-08-18T01:22:52.0793754Z   ssh-user: git
2026-08-18T01:22:52.0794326Z   persist-credentials: true
2026-08-18T01:22:52.0794990Z   clean: true
2026-08-18T01:22:52.0795532Z   sparse-checkout-cone-mode: true
2026-08-18T01:22:52.0796215Z   fetch-depth: 1
2026-08-18T01:22:52.0796739Z   fetch-tags: false
2026-08-18T01:22:52.0797210Z   show-progress: true
2026-08-18T01:22:52.0797568Z   lfs: false
2026-08-18T01:22:52.0798025Z   submodules: false
2026-08-18T01:22:52.0798584Z   set-safe-directory: true
2026-08-18T01:22:52.0799315Z   allow-unsafe-pr-checkout: false
2026-08-18T01:22:52.0800046Z ##[endgroup]
2026-08-18T01:22:52.3077013Z Syncing repository: BigscreenVR/spt-bs-core
2026-08-18T01:22:52.3078941Z ##[group]Getting Git version info
2026-08-18T01:22:52.3080123Z Working directory is 'C:\actions-runner\_work\spt-bs-core\spt-bs-core'
2026-08-18T01:22:52.3551384Z [command]"C:\Program Files\Git\cmd\git.exe" version
2026-08-18T01:22:52.3868727Z git version 2.43.0.windows.1
2026-08-18T01:22:52.3895771Z ##[endgroup]
2026-08-18T01:22:52.3905749Z Copying 'C:\Users\decid\.gitconfig' to 'C:\actions-runner\_work\_temp\6137fde3-b071-42d3-88bf-d98fe011d4cb\.gitconfig'
2026-08-18T01:22:52.3928112Z Temporarily overriding HOME='C:\actions-runner\_work\_temp\6137fde3-b071-42d3-88bf-d98fe011d4cb' before making global git config changes
2026-08-18T01:22:52.3930373Z Adding repository directory to the temporary git global config as a safe directory
2026-08-18T01:22:52.3945219Z [command]"C:\Program Files\Git\cmd\git.exe" config --global --add safe.directory C:\actions-runner\_work\spt-bs-core\spt-bs-core
2026-08-18T01:22:52.4264845Z [command]"C:\Program Files\Git\cmd\git.exe" config --local --get remote.origin.url
2026-08-18T01:22:52.4505433Z https://github.com/BigscreenVR/spt-bs-core
2026-08-18T01:22:52.4532899Z ##[group]Removing previously created refs, to avoid conflicts
2026-08-18T01:22:52.4539704Z [command]"C:\Program Files\Git\cmd\git.exe" rev-parse --symbolic-full-name --verify --quiet HEAD
2026-08-18T01:22:52.5248422Z HEAD
2026-08-18T01:22:52.5734787Z ##[endgroup]
2026-08-18T01:22:52.5739121Z [command]"C:\Program Files\Git\cmd\git.exe" submodule status
2026-08-18T01:22:53.2287345Z ##[group]Cleaning the repository
2026-08-18T01:22:53.2293008Z [command]"C:\Program Files\Git\cmd\git.exe" clean -ffdx
2026-08-18T01:23:02.0360033Z Removing target/
2026-08-18T01:23:02.0416184Z [command]"C:\Program Files\Git\cmd\git.exe" reset --hard HEAD
2026-08-18T01:23:02.2535491Z HEAD is now at 137d6d10d Merge f1a560fcf0546e5cb9c0120efd3c0e173fa8f8dc into af8e57785d479fac8d0726c9f7e2085e3ce26529
2026-08-18T01:23:02.2560824Z ##[endgroup]
2026-08-18T01:23:02.2566029Z ##[group]Disabling automatic garbage collection
2026-08-18T01:23:02.2571390Z [command]"C:\Program Files\Git\cmd\git.exe" config --local gc.auto 0
2026-08-18T01:23:02.2871455Z ##[endgroup]
2026-08-18T01:23:02.2871919Z ##[group]Setting up auth
2026-08-18T01:23:02.2878603Z [command]"C:\Program Files\Git\cmd\git.exe" config --local --name-only --get-regexp core\.sshCommand
2026-08-18T01:23:02.3129561Z [command]"C:\Program Files\Git\cmd\git.exe" submodule foreach --recursive "sh -c \"git config --local --name-only --get-regexp 'core\.sshCommand' && git config --local --unset-all 'core.sshCommand' || :\""
2026-08-18T01:23:03.0648730Z [command]"C:\Program Files\Git\cmd\git.exe" config --local --name-only --get-regexp http\.https\:\/\/github\.com\/\.extraheader
2026-08-18T01:23:03.0949377Z [command]"C:\Program Files\Git\cmd\git.exe" submodule foreach --recursive "sh -c \"git config --local --name-only --get-regexp 'http\.https\:\/\/github\.com\/\.extraheader' && git config --local --unset-all 'http.https://github.com/.extraheader' || :\""
2026-08-18T01:23:04.2310809Z [command]"C:\Program Files\Git\cmd\git.exe" config --local --name-only --get-regexp ^includeIf\.gitdir:
2026-08-18T01:23:04.2637984Z [command]"C:\Program Files\Git\cmd\git.exe" submodule foreach --recursive "git config --local --show-origin --name-only --get-regexp remote.origin.url"
2026-08-18T01:23:04.8130424Z [command]"C:\Program Files\Git\cmd\git.exe" config --local http.https://github.com/.extraheader "AUTHORIZATION: basic ***"
2026-08-18T01:23:04.8492297Z ##[endgroup]
2026-08-18T01:23:04.8492940Z ##[group]Fetching the repository
2026-08-18T01:23:04.8502891Z [command]"C:\Program Files\Git\cmd\git.exe" -c protocol.version=2 fetch --no-tags --prune --no-recurse-submodules --depth=1 origin +ce115d9949ebe86fd1d6efbb41d32d7b950b5cd5:refs/remotes/pull/148/merge
2026-08-18T01:23:07.5067732Z From https://github.com/BigscreenVR/spt-bs-core
2026-08-18T01:23:07.5068510Z  * [new ref]             ce115d9949ebe86fd1d6efbb41d32d7b950b5cd5 -> pull/148/merge
2026-08-18T01:23:07.5228501Z ##[endgroup]
2026-08-18T01:23:07.5229037Z ##[group]Determining the checkout info
2026-08-18T01:23:07.5229461Z ##[endgroup]
2026-08-18T01:23:07.5234827Z [command]"C:\Program Files\Git\cmd\git.exe" sparse-checkout disable
2026-08-18T01:23:07.5954367Z [command]"C:\Program Files\Git\cmd\git.exe" config --local --unset-all extensions.worktreeConfig
2026-08-18T01:23:07.6258633Z ##[group]Checking out the ref
2026-08-18T01:23:07.6264688Z [command]"C:\Program Files\Git\cmd\git.exe" checkout --progress --force refs/remotes/pull/148/merge
2026-08-18T01:23:07.8340776Z Previous HEAD position was 137d6d10d Merge f1a560fcf0546e5cb9c0120efd3c0e173fa8f8dc into af8e57785d479fac8d0726c9f7e2085e3ce26529
2026-08-18T01:23:07.8341886Z HEAD is now at ce115d994 Merge d9eb7d43e29c50b20d4ae32dcadce19c40598df7 into f1a560fcf0546e5cb9c0120efd3c0e173fa8f8dc
2026-08-18T01:23:07.8370659Z ##[endgroup]
2026-08-18T01:23:07.8744411Z [command]"C:\Program Files\Git\cmd\git.exe" log -1 --format=%H
2026-08-18T01:23:07.9080335Z ce115d9949ebe86fd1d6efbb41d32d7b950b5cd5
2026-08-18T01:23:07.9381418Z ##[group]Run cargo build -p spt --bin translate_proof_fixture
2026-08-18T01:23:07.9381877Z [36;1mcargo build -p spt --bin translate_proof_fixture[0m
2026-08-18T01:23:07.9386834Z shell: C:\Program Files\PowerShell\7\pwsh.EXE -command ". '{0}'"
2026-08-18T01:23:07.9387105Z ##[endgroup]
2026-08-18T01:23:09.8348493Z    Compiling proc-macro2 v1.0.106
2026-08-18T01:23:09.8348982Z    Compiling quote v1.0.45
2026-08-18T01:23:09.8349412Z    Compiling unicode-ident v1.0.24
2026-08-18T01:23:09.8349732Z    Compiling cfg-if v1.0.4
2026-08-18T01:23:09.9045410Z    Compiling serde_core v1.0.228
2026-08-18T01:23:09.9351355Z    Compiling serde v1.0.228
2026-08-18T01:23:10.2051808Z    Compiling windows-link v0.2.1
2026-08-18T01:23:10.3283266Z    Compiling typenum v1.20.1
2026-08-18T01:23:10.4333667Z    Compiling windows-sys v0.61.2
2026-08-18T01:23:11.3004498Z    Compiling syn v2.0.117
2026-08-18T01:23:11.3580448Z    Compiling getrandom v0.3.4
2026-08-18T01:23:11.7539875Z    Compiling pin-project-lite v0.2.17
2026-08-18T01:23:11.8459886Z    Compiling portable-atomic v1.13.1
2026-08-18T01:23:12.3218597Z    Compiling version_check v0.9.5
2026-08-18T01:23:12.6815999Z    Compiling shlex v2.0.1
2026-08-18T01:23:12.8483305Z    Compiling jobserver v0.1.34
2026-08-18T01:23:12.8653585Z    Compiling find-msvc-tools v0.1.9
2026-08-18T01:23:13.1905546Z    Compiling memchr v2.8.1
2026-08-18T01:23:13.7740120Z    Compiling cc v1.2.63
2026-08-18T01:23:14.0151215Z    Compiling critical-section v1.2.0
2026-08-18T01:23:14.1676278Z    Compiling subtle v2.6.1
2026-08-18T01:23:14.3929672Z    Compiling smallvec v1.15.1
2026-08-18T01:23:14.6187218Z    Compiling equivalent v1.0.2
2026-08-18T01:23:14.7311889Z    Compiling futures-core v0.3.32
2026-08-18T01:23:14.8422605Z    Compiling generic-array v0.14.7
2026-08-18T01:23:15.1028799Z    Compiling bytes v1.11.1
2026-08-18T01:23:15.4148459Z    Compiling itoa v1.0.18
2026-08-18T01:23:15.6965078Z    Compiling semver v1.0.28
2026-08-18T01:23:15.9703274Z    Compiling rustc_version v0.4.1
2026-08-18T01:23:16.2742158Z    Compiling synstructure v0.13.2
2026-08-18T01:23:16.3621076Z    Compiling stable_deref_trait v1.2.1
2026-08-18T01:23:16.4723653Z    Compiling log v0.4.32
2026-08-18T01:23:16.8287829Z    Compiling crypto-common v0.1.7
2026-08-18T01:23:16.8427252Z    Compiling serde_derive v1.0.228
2026-08-18T01:23:16.9328250Z    Compiling zeroize_derive v1.4.3
2026-08-18T01:23:17.0164573Z    Compiling zerofrom-derive v0.1.7
2026-08-18T01:23:17.6287596Z    Compiling zeroize v1.8.2
2026-08-18T01:23:17.9938637Z    Compiling socket2 v0.6.4
2026-08-18T01:23:18.3507538Z    Compiling zerofrom v0.1.8
2026-08-18T01:23:18.6036815Z    Compiling mio v1.2.1
2026-08-18T01:23:18.6039700Z    Compiling yoke-derive v0.8.2
2026-08-18T01:23:19.2328089Z    Compiling tokio-macros v2.7.0
2026-08-18T01:23:19.5574719Z    Compiling futures-io v0.3.32
2026-08-18T01:23:19.6383415Z    Compiling futures-sink v0.3.32
2026-08-18T01:23:19.7270680Z    Compiling slab v0.4.12
2026-08-18T01:23:19.7686372Z    Compiling futures-channel v0.3.32
2026-08-18T01:23:19.8741630Z    Compiling tokio v1.52.3
2026-08-18T01:23:19.8782919Z    Compiling yoke v0.8.3
2026-08-18T01:23:20.0056451Z    Compiling futures-macro v0.3.32
2026-08-18T01:23:20.2711849Z    Compiling rand_core v0.10.1
2026-08-18T01:23:20.4114142Z    Compiling rustversion v1.0.22
2026-08-18T01:23:20.7012936Z    Compiling hashbrown v0.17.1
2026-08-18T01:23:20.7380427Z    Compiling futures-task v0.3.32
2026-08-18T01:23:20.8907791Z    Compiling futures-util v0.3.32
2026-08-18T01:23:21.0878546Z    Compiling once_cell v1.21.4
2026-08-18T01:23:21.2384622Z    Compiling indexmap v2.14.0
2026-08-18T01:23:21.3966904Z    Compiling zerovec-derive v0.11.3
2026-08-18T01:23:21.8696094Z    Compiling getrandom v0.2.17
2026-08-18T01:23:21.9837772Z    Compiling cpufeatures v0.2.17
2026-08-18T01:23:22.4252789Z    Compiling zerovec v0.11.6
2026-08-18T01:23:22.5816519Z    Compiling displaydoc v0.2.6
2026-08-18T01:23:23.1018560Z    Compiling hybrid-array v0.4.12
2026-08-18T01:23:23.3984900Z    Compiling getrandom v0.4.2
2026-08-18T01:23:23.5087903Z    Compiling fnv v1.0.7
2026-08-18T01:23:23.6136305Z    Compiling libc v0.2.186
2026-08-18T01:23:23.6244200Z    Compiling cfg_aliases v0.2.1
2026-08-18T01:23:23.6901904Z    Compiling strsim v0.11.1
2026-08-18T01:23:23.9235616Z    Compiling block-buffer v0.12.0
2026-08-18T01:23:24.0363137Z    Compiling crypto-common v0.2.2
2026-08-18T01:23:24.1687243Z    Compiling tinystr v0.8.3
2026-08-18T01:23:24.2165346Z    Compiling tracing-core v0.1.36
2026-08-18T01:23:24.4649035Z    Compiling tracing-attributes v0.1.31
2026-08-18T01:23:24.9090870Z    Compiling autocfg v1.5.1
2026-08-18T01:23:25.3291490Z    Compiling litemap v0.8.2
2026-08-18T01:23:25.3468412Z    Compiling writeable v0.6.3
2026-08-18T01:23:25.5642539Z    Compiling icu_locale_core v2.2.0
2026-08-18T01:23:25.6195032Z    Compiling zerotrie v0.2.4
2026-08-18T01:23:25.8675622Z    Compiling tracing v0.1.44
2026-08-18T01:23:25.9718696Z    Compiling potential_utf v0.1.5
2026-08-18T01:23:26.2296585Z    Compiling cmake v0.1.58
2026-08-18T01:23:26.3578535Z    Compiling ident_case v1.0.1
2026-08-18T01:23:26.7790794Z    Compiling dunce v1.0.5
2026-08-18T01:23:26.8034437Z    Compiling icu_normalizer_data v2.2.0
2026-08-18T01:23:27.1045883Z    Compiling fs_extra v1.3.0
2026-08-18T01:23:27.1124873Z    Compiling utf8_iter v1.0.4
2026-08-18T01:23:27.2089132Z    Compiling icu_properties_data v2.2.0
2026-08-18T01:23:27.3039699Z    Compiling icu_collections v2.2.0
2026-08-18T01:23:27.4382513Z    Compiling aws-lc-sys v0.41.0
2026-08-18T01:23:27.4706051Z    Compiling icu_provider v2.2.0
2026-08-18T01:23:27.8274461Z    Compiling tokio-util v0.7.18
2026-08-18T01:23:28.1570529Z    Compiling percent-encoding v2.3.2
2026-08-18T01:23:28.2387336Z    Compiling icu_normalizer v2.2.0
2026-08-18T01:23:28.4181727Z    Compiling icu_properties v2.2.0
2026-08-18T01:23:28.9299210Z    Compiling inout v0.2.2
2026-08-18T01:23:29.0965237Z    Compiling http v1.4.1
2026-08-18T01:23:29.3562402Z    Compiling ring v0.17.14
2026-08-18T01:23:29.8197391Z    Compiling aws-lc-rs v1.17.0
2026-08-18T01:23:29.8730613Z    Compiling cpufeatures v0.3.0
2026-08-18T01:23:29.9482268Z    Compiling unicode-segmentation v1.13.3
2026-08-18T01:23:30.1037835Z    Compiling thiserror v2.0.18
2026-08-18T01:23:30.3621773Z    Compiling idna_adapter v1.2.2
2026-08-18T01:23:30.4775058Z    Compiling cipher v0.5.2
2026-08-18T01:23:30.5382053Z    Compiling thiserror-impl v2.0.18
2026-08-18T01:23:30.7186727Z    Compiling curve25519-dalek-derive v0.1.1
2026-08-18T01:23:31.3053437Z    Compiling scopeguard v1.2.0
2026-08-18T01:23:31.4062777Z    Compiling lock_api v0.4.14
2026-08-18T01:23:31.6187017Z    Compiling chacha20 v0.10.0
2026-08-18T01:23:31.9138800Z    Compiling idna v1.1.0
2026-08-18T01:23:32.0727148Z    Compiling form_urlencoded v1.2.2
2026-08-18T01:23:32.2352370Z    Compiling ipnet v2.12.0
2026-08-18T01:23:32.6662606Z    Compiling rustls-pki-types v1.14.1
2026-08-18T01:23:32.8835848Z    Compiling block-buffer v0.10.4
2026-08-18T01:23:32.9008004Z    Compiling untrusted v0.9.0
2026-08-18T01:23:33.0079816Z    Compiling bitflags v2.12.1
2026-08-18T01:23:33.0101850Z    Compiling winapi v0.3.9
2026-08-18T01:23:33.2961419Z    Compiling digest v0.10.7
2026-08-18T01:23:33.5219158Z    Compiling url v2.5.8
2026-08-18T01:23:33.6512422Z    Compiling rand v0.10.1
2026-08-18T01:23:34.3286448Z    Compiling darling_core v0.20.11
2026-08-18T01:23:34.6668640Z    Compiling num-traits v0.2.19
2026-08-18T01:23:34.9844631Z    Compiling windows-strings v0.5.1
2026-08-18T01:23:35.3297725Z    Compiling windows-result v0.4.1
2026-08-18T01:23:35.6238845Z    Compiling heck v0.5.0
2026-08-18T01:23:35.8623030Z    Compiling rustls v0.23.40
2026-08-18T01:23:36.1456907Z    Compiling convert_case v0.10.0
2026-08-18T01:23:36.4346674Z    Compiling anyhow v1.0.102
2026-08-18T01:23:36.7333505Z    Compiling const-oid v0.10.2
2026-08-18T01:23:36.9137541Z    Compiling darling_macro v0.20.11
2026-08-18T01:23:36.9474272Z    Compiling atomic-waker v1.1.2
2026-08-18T01:23:37.0465489Z    Compiling unicode-xid v0.2.6
2026-08-18T01:23:37.1382626Z    Compiling derive_more-impl v2.1.1
2026-08-18T01:23:37.3112155Z    Compiling darling v0.20.11
2026-08-18T01:23:38.0109804Z    Compiling parking_lot_core v0.9.12
2026-08-18T01:23:38.2345247Z    Compiling zerocopy v0.8.50
2026-08-18T01:23:38.4061772Z    Compiling httparse v1.10.1
2026-08-18T01:23:38.9011463Z    Compiling derive_builder_core v0.20.2
2026-08-18T01:23:39.3023522Z    Compiling h2 v0.4.14
2026-08-18T01:23:39.8702663Z    Compiling http-body v1.0.1
2026-08-18T01:23:40.0131208Z    Compiling curve25519-dalek v4.1.3
2026-08-18T01:23:40.4658862Z    Compiling ahash v0.8.12
2026-08-18T01:23:40.6146754Z    Compiling derive_more v2.1.1
2026-08-18T01:23:40.8885445Z    Compiling powerfmt v0.2.0
2026-08-18T01:23:41.0805272Z    Compiling base64ct v1.8.3
2026-08-18T01:23:41.1373878Z    Compiling either v1.16.0
2026-08-18T01:23:41.6618354Z    Compiling pem-rfc7468 v1.0.0
2026-08-18T01:23:41.7115919Z    Compiling deranged v0.5.8
2026-08-18T01:23:42.6217960Z    Compiling derive_builder_macro v0.20.2
2026-08-18T01:23:43.5064133Z    Compiling uuid v1.23.2
2026-08-18T01:23:44.2642261Z    Compiling rand_core v0.6.4
2026-08-18T01:23:44.5520635Z    Compiling n0-error-macros v0.1.3
2026-08-18T01:23:45.4830754Z    Compiling windows-implement v0.60.2
2026-08-18T01:23:45.5366871Z    Compiling windows-interface v0.59.3
2026-08-18T01:23:46.3197451Z    Compiling spez v0.1.2
2026-08-18T01:23:46.3364863Z    Compiling pkg-config v0.3.33
2026-08-18T01:23:46.6746865Z    Compiling time-core v0.1.8
2026-08-18T01:23:46.8539646Z    Compiling num-conv v0.2.2
2026-08-18T01:23:46.9692080Z    Compiling vcpkg v0.2.15
2026-08-18T01:23:47.0736645Z    Compiling try-lock v0.2.5
2026-08-18T01:23:47.1825829Z    Compiling tinyvec_macros v0.1.1
2026-08-18T01:23:47.3282727Z    Compiling base64 v0.22.1
2026-08-18T01:23:47.5472078Z    Compiling zmij v1.0.21
2026-08-18T01:23:47.7102978Z    Compiling fastrand v2.4.1
2026-08-18T01:23:47.8889663Z    Compiling tower-service v0.3.3
2026-08-18T01:23:48.1191769Z    Compiling data-encoding v2.11.0
2026-08-18T01:23:48.1831039Z    Compiling libsqlite3-sys v0.30.1
2026-08-18T01:23:48.4149085Z    Compiling tinyvec v1.11.0
2026-08-18T01:23:48.6800214Z    Compiling want v0.3.1
2026-08-18T01:23:48.8137962Z    Compiling n0-error v0.1.3
2026-08-18T01:23:48.9795770Z    Compiling windows-core v0.62.2
2026-08-18T01:23:49.5249679Z    Compiling parking_lot v0.12.5
2026-08-18T01:23:49.8512470Z    Compiling derive_builder v0.20.2
2026-08-18T01:23:50.0925269Z    Compiling der v0.8.0-rc.10
2026-08-18T01:23:50.1110082Z    Compiling sha2 v0.10.9
2026-08-18T01:23:50.5622950Z    Compiling n0-future v0.3.2
2026-08-18T01:23:50.8914220Z    Compiling vergen-lib v9.1.0
2026-08-18T01:23:51.1773829Z    Compiling pin-project-internal v1.1.13
2026-08-18T01:23:51.2563022Z    Compiling inout v0.1.4
2026-08-18T01:23:51.4135630Z    Compiling spin v0.10.0
2026-08-18T01:23:51.5241385Z    Compiling cordyceps v0.3.4
2026-08-18T01:23:51.7790479Z    Compiling crossbeam-utils v0.8.21
2026-08-18T01:23:51.9027997Z    Compiling serde_json v1.0.150
2026-08-18T01:23:52.1917194Z    Compiling spt-procident v0.55.0 (C:\actions-runner\_work\spt-bs-core\spt-bs-core\crates\spt-procident)
2026-08-18T01:23:52.1936180Z    Compiling windows_x86_64_msvc v0.52.6
2026-08-18T01:23:52.2888255Z    Compiling httpdate v1.0.3
2026-08-18T01:23:52.4111874Z    Compiling winnow v1.0.3
2026-08-18T01:23:52.5129150Z    Compiling parking v2.2.1
2026-08-18T01:23:52.5172355Z    Compiling signature v2.2.0
2026-08-18T01:23:52.6501183Z    Compiling diatomic-waker v0.2.3
2026-08-18T01:23:52.6785737Z    Compiling ed25519 v2.2.3
2026-08-18T01:23:52.7838183Z    Compiling futures-buffered v0.2.13
2026-08-18T01:23:52.8590972Z    Compiling futures-lite v2.6.1
2026-08-18T01:23:53.1806846Z    Compiling hyper v1.10.1
2026-08-18T01:23:53.5078779Z    Compiling toml_parser v1.1.2+spec-1.1.0
2026-08-18T01:23:53.5540020Z    Compiling pin-project v1.1.13
2026-08-18T01:23:53.7539510Z    Compiling spt-poolguard v0.55.0 (C:\actions-runner\_work\spt-bs-core\spt-bs-core\crates\spt-poolguard)
2026-08-18T01:23:54.3457309Z    Compiling cipher v0.4.4
2026-08-18T01:23:54.7513503Z    Compiling spki v0.8.0-rc.4
2026-08-18T01:23:55.0148965Z    Compiling hashbrown v0.14.5
2026-08-18T01:23:55.6398738Z    Compiling digest v0.11.3
2026-08-18T01:23:55.7343541Z    Compiling noq-udp v0.10.0
2026-08-18T01:23:55.8680234Z    Compiling vergen-lib v0.1.6
2026-08-18T01:23:56.7656633Z    Compiling vergen v9.1.0
2026-08-18T01:23:56.8070831Z    Compiling universal-hash v0.5.1
2026-08-18T01:23:56.9725221Z    Compiling heapless v0.7.17
2026-08-18T01:23:57.1542690Z    Compiling curve25519-dalek v5.0.0-pre.6
2026-08-18T01:23:57.2205848Z    Compiling sync_wrapper v1.0.2
2026-08-18T01:23:57.2986919Z    Compiling aho-corasick v1.1.4
2026-08-18T01:23:57.3287126Z    Compiling regex-syntax v0.8.10
2026-08-18T01:23:57.4538589Z    Compiling opaque-debug v0.3.1
2026-08-18T01:23:57.6175699Z    Compiling allocator-api2 v0.2.21
2026-08-18T01:23:57.9039098Z    Compiling byteorder v1.5.0
2026-08-18T01:23:58.0559999Z    Compiling toml_datetime v1.1.1+spec-1.1.0
2026-08-18T01:23:58.2716051Z    Compiling toml_edit v0.25.12+spec-1.1.0
2026-08-18T01:23:59.4025102Z    Compiling regex-automata v0.4.14
2026-08-18T01:24:00.0095460Z    Compiling hash32 v0.2.1
2026-08-18T01:24:00.1699275Z    Compiling polyval v0.6.2
2026-08-18T01:24:00.8094538Z    Compiling hashlink v0.9.1
2026-08-18T01:24:01.1643641Z    Compiling pkcs8 v0.11.0-rc.10
2026-08-18T01:24:01.8587607Z    Compiling spt-store v0.55.0 (C:\actions-runner\_work\spt-bs-core\spt-bs-core\crates\spt-store)
2026-08-18T01:24:02.4965559Z    Compiling hyper-util v0.1.20
2026-08-18T01:24:02.9614942Z    Compiling ed25519-dalek v2.2.0
2026-08-18T01:24:03.2576064Z    Compiling prefix-trie v0.8.4
2026-08-18T01:24:03.8401977Z    Compiling spin v0.9.8
2026-08-18T01:24:03.9644036Z    Compiling futures-executor v0.3.32
2026-08-18T01:24:04.0027647Z    Compiling vergen-gitcl v1.0.8
2026-08-18T01:24:04.1838271Z    Compiling windows-threading v0.2.1
2026-08-18T01:24:04.2760599Z    Compiling fallible-streaming-iterator v0.1.9
2026-08-18T01:24:04.3191579Z    Compiling tower-layer v0.3.3
2026-08-18T01:24:04.4198852Z    Compiling fallible-iterator v0.3.0
2026-08-18T01:24:04.4615997Z    Compiling signature v3.0.0
2026-08-18T01:24:04.6225598Z    Compiling ryu v1.0.23
2026-08-18T01:24:04.6820587Z    Compiling rusqlite v0.32.1
2026-08-18T01:24:04.7758552Z    Compiling ed25519 v3.0.0-rc.4
2026-08-18T01:24:05.0558429Z    Compiling data-encoding-macro-internal v0.1.18
2026-08-18T01:24:05.1859145Z    Compiling windows-future v0.3.2
2026-08-18T01:24:05.5295722Z    Compiling futures v0.3.32
2026-08-18T01:24:05.8543362Z    Compiling hickory-proto v0.26.0-beta.4
2026-08-18T01:24:06.0888486Z    Compiling spt-proto v0.55.0 (C:\actions-runner\_work\spt-bs-core\spt-bs-core\crates\spt-proto)
2026-08-18T01:24:06.1260450Z    Compiling windows-targets v0.52.6
2026-08-18T01:24:06.3631420Z    Compiling regex v1.12.3
2026-08-18T01:24:07.8193725Z    Compiling ghash v0.5.1
2026-08-18T01:24:07.9565679Z    Compiling proc-macro-crate v3.5.0
2026-08-18T01:24:08.5204291Z    Compiling sha2 v0.11.0-rc.5
2026-08-18T01:24:09.1178926Z    Compiling ctr v0.9.2
2026-08-18T01:24:09.2405321Z    Compiling aes v0.8.4
2026-08-18T01:24:09.3320895Z    Compiling windows-numerics v0.3.1
2026-08-18T01:24:09.4958897Z    Compiling windows-collections v0.3.2
2026-08-18T01:24:09.7757817Z    Compiling time v0.3.47
2026-08-18T01:24:09.8825056Z    Compiling http-body-util v0.1.3
2026-08-18T01:24:10.0450416Z    Compiling fs2 v0.4.3
2026-08-18T01:24:10.0918171Z    Compiling cobs v0.3.0
2026-08-18T01:24:10.2169730Z    Compiling aead v0.5.2
2026-08-18T01:24:10.2490010Z    Compiling postcard-derive v0.2.2
2026-08-18T01:24:10.3190549Z    Compiling ipconfig v0.3.4
2026-08-18T01:24:10.4920640Z    Compiling widestring v1.2.1
2026-08-18T01:24:10.7243566Z    Compiling arrayvec v0.7.6
2026-08-18T01:24:10.8800969Z    Compiling utf8parse v0.2.2
2026-08-18T01:24:11.2363362Z    Compiling postcard v1.1.3
2026-08-18T01:24:11.5237069Z    Compiling aes-gcm v0.10.3
2026-08-18T01:24:11.6473950Z    Compiling windows v0.62.2
2026-08-18T01:24:11.6491227Z    Compiling ed25519-dalek v3.0.0-pre.6
2026-08-18T01:24:11.9564158Z    Compiling num_enum_derive v0.7.6
2026-08-18T01:24:12.7628852Z    Compiling windows-sys v0.59.0
2026-08-18T01:24:14.3582318Z    Compiling data-encoding-macro v0.1.20
2026-08-18T01:24:14.5021777Z    Compiling tower v0.5.3
2026-08-18T01:24:15.0080178Z    Compiling crossbeam-epoch v0.9.18
2026-08-18T01:24:15.3309660Z    Compiling crossbeam-channel v0.5.15
2026-08-18T01:24:15.7846897Z    Compiling chrono v0.4.45
2026-08-18T01:24:17.1412051Z    Compiling strum_macros v0.28.0
2026-08-18T01:24:19.1640480Z    Compiling iroh-metrics-derive v0.4.1
2026-08-18T01:24:19.5714476Z    Compiling windows-registry v0.6.1
2026-08-18T01:24:19.8522883Z    Compiling memoffset v0.6.5
2026-08-18T01:24:20.1139726Z    Compiling netwatch v0.16.0
2026-08-18T01:24:20.3773718Z    Compiling noq v0.18.0
2026-08-18T01:24:20.6138425Z    Compiling async-trait v0.1.89
2026-08-18T01:24:21.3884343Z    Compiling enum-assoc v1.3.0
2026-08-18T01:24:21.7232758Z    Compiling acto v0.8.2
2026-08-18T01:24:22.0089242Z    Compiling blake3 v1.8.5
2026-08-18T01:24:22.1126466Z    Compiling tagptr v0.2.0
2026-08-18T01:24:22.2240148Z    Compiling lru-slab v0.1.2
2026-08-18T01:24:22.3131576Z    Compiling rustc-hash v2.1.2
2026-08-18T01:24:22.3863205Z    Compiling thiserror v1.0.69
2026-08-18T01:24:22.4123862Z    Compiling ref-cast v1.0.25
2026-08-18T01:24:22.6296453Z    Compiling xml-rs v0.8.28
2026-08-18T01:24:22.7040877Z    Compiling mac-addr v0.3.0
2026-08-18T01:24:22.8619360Z    Compiling sorted-index-buffer v0.2.1
2026-08-18T01:24:22.9820196Z    Compiling identity-hash v0.1.0
2026-08-18T01:24:23.0686657Z    Compiling foldhash v0.2.0
2026-08-18T01:24:23.1993838Z    Compiling hashbrown v0.16.1
2026-08-18T01:24:23.7010091Z    Compiling xmltree v0.10.3
2026-08-18T01:24:23.8354419Z    Compiling netdev v0.42.0
2026-08-18T01:24:24.4324241Z    Compiling moka v0.12.15
2026-08-18T01:24:25.4523063Z    Compiling iroh-metrics v0.38.3
2026-08-18T01:24:25.6827734Z    Compiling strum v0.28.0
2026-08-18T01:24:25.7264149Z    Compiling wmi v0.18.4
2026-08-18T01:24:25.8771260Z    Compiling spt-msg v0.55.0 (C:\actions-runner\_work\spt-bs-core\spt-bs-core\crates\spt-msg)
2026-08-18T01:24:26.4491141Z    Compiling tower-http v0.6.11
2026-08-18T01:24:26.8294407Z    Compiling iroh-base v0.98.0
2026-08-18T01:24:26.8636624Z    Compiling num_enum v0.7.6
2026-08-18T01:24:27.0721255Z    Compiling iroh-relay v0.98.0
2026-08-18T01:24:27.2458243Z    Compiling n0-watcher v0.6.1
2026-08-18T01:24:27.3605966Z    Compiling attohttpc v0.30.1
2026-08-18T01:24:27.4412886Z    Compiling simple-dns v0.9.3
2026-08-18T01:24:27.8485929Z    Compiling tokio-stream v0.1.18
2026-08-18T01:24:28.2028601Z    Compiling serial-core v0.4.0
2026-08-18T01:24:28.3570748Z    Compiling toml_datetime v0.6.11
2026-08-18T01:24:28.5969494Z    Compiling serde_spanned v0.6.9
2026-08-18T01:24:28.7137150Z    Compiling thiserror-impl v1.0.69
2026-08-18T01:24:28.7440562Z    Compiling ref-cast-impl v1.0.25
2026-08-18T01:24:29.1367862Z    Compiling serde_derive_internals v0.29.1
2026-08-18T01:24:29.2506585Z    Compiling constant_time_eq v0.4.2
2026-08-18T01:24:29.5256875Z    Compiling winreg v0.10.1
2026-08-18T01:24:30.3825070Z    Compiling resolv-conf v0.7.6
2026-08-18T01:24:30.3884212Z    Compiling sha1_smol v1.0.1
2026-08-18T01:24:30.5778482Z    Compiling toml_write v0.1.2
2026-08-18T01:24:30.6762532Z    Compiling winnow v0.7.15
2026-08-18T01:24:30.7650510Z    Compiling smol_str v0.1.24
2026-08-18T01:24:30.8738715Z    Compiling arrayref v0.3.9
2026-08-18T01:24:30.9846214Z    Compiling simdutf8 v0.1.5
2026-08-18T01:24:31.6227181Z    Compiling schemars_derive v1.2.1
2026-08-18T01:24:32.2394618Z    Compiling toml_edit v0.22.27
2026-08-18T01:24:32.3969299Z    Compiling serial-windows v0.4.0
2026-08-18T01:24:32.5564342Z    Compiling iroh-dns v0.98.0
2026-08-18T01:24:33.0661513Z    Compiling igd-next v0.17.1
2026-08-18T01:24:35.2969390Z    Compiling lru v0.16.4
2026-08-18T01:24:35.4294313Z    Compiling hmac v0.12.1
2026-08-18T01:24:35.5269786Z    Compiling webpki-roots v1.0.7
2026-08-18T01:24:35.6088880Z    Compiling darling_core v0.23.0
2026-08-18T01:24:36.2700054Z    Compiling seize v0.5.1
2026-08-18T01:24:36.6295429Z    Compiling iroh v0.98.2
2026-08-18T01:24:36.8811083Z    Compiling serde_bytes v0.11.19
2026-08-18T01:24:37.1208611Z    Compiling once_cell_polyfill v1.70.2
2026-08-18T01:24:37.2162585Z    Compiling pin-utils v0.1.0
2026-08-18T01:24:37.2869749Z    Compiling dyn-clone v1.0.20
2026-08-18T01:24:37.3845638Z    Compiling bitflags v1.3.2
2026-08-18T01:24:37.4048313Z    Compiling lazy_static v1.5.0
2026-08-18T01:24:37.4428130Z    Compiling anstyle v1.0.14
2026-08-18T01:24:37.4709547Z    Compiling cmov v0.5.4
2026-08-18T01:24:37.6387710Z    Compiling ctutils v0.4.2
2026-08-18T01:24:37.6632130Z    Compiling anstyle-wincon v3.0.11
2026-08-18T01:24:37.7961172Z    Compiling shared_library v0.1.9
2026-08-18T01:24:37.9083986Z    Compiling nix v0.25.1
2026-08-18T01:24:37.9677184Z    Compiling schemars v1.2.1
2026-08-18T01:24:38.0567548Z    Compiling papaya v0.2.4
2026-08-18T01:24:38.3708963Z    Compiling hkdf v0.12.4
2026-08-18T01:24:38.4317610Z    Compiling darling_macro v0.23.0
2026-08-18T01:24:38.4797930Z    Compiling portmapper v0.16.0
2026-08-18T01:24:38.7295218Z    Compiling toml v0.8.23
2026-08-18T01:24:39.5486610Z    Compiling serial v0.4.0
2026-08-18T01:24:39.6237339Z    Compiling filedescriptor v0.8.3
2026-08-18T01:24:39.9587436Z    Compiling swarm-discovery v0.6.0-alpha.2 (https://github.com/SaberMage/swarm-discovery?rev=89a2200d54a4e3cab2f46cc75ebff49a1fb07614#89a2200d)
2026-08-18T01:24:40.3605419Z    Compiling anstyle-parse v1.0.0
2026-08-18T01:24:40.6174136Z    Compiling backon v1.6.0
2026-08-18T01:24:40.8865850Z    Compiling anstyle-query v1.1.5
2026-08-18T01:24:41.0466204Z    Compiling vte_generate_state_changes v0.1.2
2026-08-18T01:24:41.3131456Z    Compiling foldhash v0.1.5
2026-08-18T01:24:41.5665370Z    Compiling unicode-width v0.2.0
2026-08-18T01:24:41.9228669Z    Compiling colorchoice v1.0.5
2026-08-18T01:24:42.0817281Z    Compiling downcast-rs v1.2.1
2026-08-18T01:24:42.1785891Z    Compiling is_terminal_polyfill v1.70.2
2026-08-18T01:24:42.2795728Z    Compiling instability v0.3.12
2026-08-18T01:24:42.4940166Z    Compiling paste v1.0.15
2026-08-18T01:24:42.7338400Z    Compiling shell-words v1.1.1
2026-08-18T01:24:42.9374529Z    Compiling portable-pty v0.8.1
2026-08-18T01:24:43.5629985Z    Compiling anstream v1.0.0
2026-08-18T01:24:44.0509824Z    Compiling hashbrown v0.15.5
2026-08-18T01:24:44.0537883Z    Compiling vte v0.13.1
2026-08-18T01:24:44.6930224Z    Compiling spt-runtime v0.55.0 (C:\actions-runner\_work\spt-bs-core\spt-bs-core\crates\spt-runtime)
2026-08-18T01:24:44.7242268Z    Compiling darling v0.23.0
2026-08-18T01:24:44.9663026Z    Compiling spake2 v0.4.0
2026-08-18T01:24:44.9685008Z    Compiling itertools v0.13.0
2026-08-18T01:24:45.2583590Z    Compiling crossterm_winapi v0.9.1
2026-08-18T01:24:45.7380473Z    Compiling strum_macros v0.26.4
2026-08-18T01:24:46.8505248Z    Compiling sha1 v0.10.6
2026-08-18T01:24:47.1298356Z    Compiling castaway v0.2.4
2026-08-18T01:24:47.3135228Z    Compiling terminal_size v0.4.4
2026-08-18T01:24:47.4482027Z    Compiling recvmsg v1.0.0
2026-08-18T01:24:47.7152380Z    Compiling doctest-file v1.1.1
2026-08-18T01:24:47.7916710Z    Compiling static_assertions v1.1.0
2026-08-18T01:24:47.9787493Z    Compiling indoc v2.0.7
2026-08-18T01:24:48.1132614Z    Compiling clap_lex v1.1.0
2026-08-18T01:24:48.3764713Z    Compiling unicode-width v0.1.14
2026-08-18T01:24:48.7246337Z    Compiling unicode-truncate v1.1.0
2026-08-18T01:24:48.9212688Z    Compiling clap_builder v4.6.0
2026-08-18T01:24:49.0748560Z    Compiling interprocess v2.4.2
2026-08-18T01:24:50.2478944Z    Compiling compact_str v0.8.2
2026-08-18T01:24:50.9812592Z    Compiling strum v0.26.3
2026-08-18T01:24:51.2645277Z    Compiling spt-live v0.55.0 (C:\actions-runner\_work\spt-bs-core\spt-bs-core\crates\spt-live)
2026-08-18T01:24:52.3951030Z    Compiling crossterm v0.28.1
2026-08-18T01:24:53.9760267Z    Compiling lru v0.12.5
2026-08-18T01:24:54.1988103Z    Compiling spt-term v0.55.0 (C:\actions-runner\_work\spt-bs-core\spt-bs-core\crates\spt-term)
2026-08-18T01:24:54.7361743Z    Compiling clap_derive v4.6.1
2026-08-18T01:24:54.8652311Z    Compiling error-code v3.3.2
2026-08-18T01:24:55.0496830Z    Compiling cassowary v0.3.0
2026-08-18T01:24:55.8089233Z    Compiling ratatui v0.29.0
2026-08-18T01:24:56.5235515Z    Compiling clap v4.6.1
2026-08-18T01:24:56.7459080Z    Compiling clipboard-win v5.4.1
2026-08-18T01:24:56.9551444Z    Compiling nucleo-matcher v0.3.1
2026-08-18T01:24:57.1695663Z    Compiling qrcode v0.14.1
2026-08-18T01:25:08.5448536Z    Compiling rustls-webpki v0.103.13
2026-08-18T01:25:11.1189082Z    Compiling tokio-rustls v0.26.4
2026-08-18T01:25:11.1189502Z    Compiling noq-proto v0.17.0
2026-08-18T01:25:11.1189828Z    Compiling rustls-platform-verifier v0.7.0
2026-08-18T01:25:11.3326047Z    Compiling hickory-net v0.26.0-beta.4
2026-08-18T01:25:11.4017612Z    Compiling hyper-rustls v0.27.9
2026-08-18T01:25:11.6967348Z    Compiling reqwest v0.13.4
2026-08-18T01:25:13.2981114Z    Compiling hickory-resolver v0.26.0-beta.4
2026-08-18T01:25:16.4373595Z    Compiling tokio-websockets v0.13.2
2026-08-18T01:25:35.0716329Z    Compiling spt-net v0.55.0 (C:\actions-runner\_work\spt-bs-core\spt-bs-core\crates\spt-net)
2026-08-18T01:25:37.2055921Z    Compiling spt-daemon v0.55.0 (C:\actions-runner\_work\spt-bs-core\spt-bs-core\crates\spt-daemon)
2026-08-18T01:25:54.5675342Z    Compiling spt v0.55.0 (C:\actions-runner\_work\spt-bs-core\spt-bs-core\crates\spt)
2026-08-18T01:25:54.8658793Z     Finished `dev` profile [unoptimized + debuginfo] target(s) in 2m 46s
2026-08-18T01:25:55.0133414Z ##[group]Run cargo nextest run --workspace -E 'kind(lib) + kind(bin)'
2026-08-18T01:25:55.0133932Z [36;1mcargo nextest run --workspace -E 'kind(lib) + kind(bin)'[0m
2026-08-18T01:25:55.0140508Z shell: C:\Program Files\PowerShell\7\pwsh.EXE -command ". '{0}'"
2026-08-18T01:25:55.0141003Z ##[endgroup]
2026-08-18T01:25:56.7833377Z    Compiling fastrand v2.4.1
2026-08-18T01:25:56.7855122Z    Compiling spt-poolguard v0.55.0 (C:\actions-runner\_work\spt-bs-core\spt-bs-core\crates\spt-poolguard)
2026-08-18T01:25:56.8462476Z    Compiling bytemuck v1.25.2
2026-08-18T01:25:56.8462966Z    Compiling mock-adapter v0.55.0 (C:\actions-runner\_work\spt-bs-core\spt-bs-core\adapters\mock)
2026-08-18T01:25:56.9736798Z    Compiling tempfile v3.27.0
2026-08-18T01:25:57.1520379Z    Compiling futures-lite v2.6.1
2026-08-18T01:25:57.5024061Z    Compiling backon v1.6.0
2026-08-18T01:25:57.5321863Z    Compiling spt-test-support v0.55.0 (C:\actions-runner\_work\spt-bs-core\spt-bs-core\crates\spt-test-support)
2026-08-18T01:25:57.7178960Z    Compiling n0-future v0.3.2
2026-08-18T01:25:57.7690046Z    Compiling rgb v0.8.53
2026-08-18T01:25:57.7707097Z    Compiling spt-store v0.55.0 (C:\actions-runner\_work\spt-bs-core\spt-bs-core\crates\spt-store)
2026-08-18T01:25:57.7981582Z    Compiling n0-watcher v0.6.1
2026-08-18T01:25:57.8343716Z    Compiling iroh-dns v0.98.0
2026-08-18T01:25:57.9959275Z    Compiling netwatch v0.16.0
2026-08-18T01:25:58.1999414Z    Compiling avt v0.18.0
2026-08-18T01:25:58.2592483Z    Compiling iroh-relay v0.98.0
2026-08-18T01:25:59.4903046Z    Compiling portmapper v0.16.0
2026-08-18T01:26:04.1683512Z    Compiling spt-msg v0.55.0 (C:\actions-runner\_work\spt-bs-core\spt-bs-core\crates\spt-msg)
2026-08-18T01:26:04.9378020Z    Compiling spt-term v0.55.0 (C:\actions-runner\_work\spt-bs-core\spt-bs-core\crates\spt-term)
2026-08-18T01:26:07.3519992Z    Compiling spt-runtime v0.55.0 (C:\actions-runner\_work\spt-bs-core\spt-bs-core\crates\spt-runtime)
2026-08-18T01:26:07.4567657Z    Compiling iroh v0.98.2
2026-08-18T01:26:11.3762475Z    Compiling spt-live v0.55.0 (C:\actions-runner\_work\spt-bs-core\spt-bs-core\crates\spt-live)
2026-08-18T01:26:25.1679987Z    Compiling spt-proto v0.55.0 (C:\actions-runner\_work\spt-bs-core\spt-bs-core\crates\spt-proto)
2026-08-18T01:26:25.5364338Z    Compiling spt-procident v0.55.0 (C:\actions-runner\_work\spt-bs-core\spt-bs-core\crates\spt-procident)
2026-08-18T01:26:28.6054698Z    Compiling spt-net v0.55.0 (C:\actions-runner\_work\spt-bs-core\spt-bs-core\crates\spt-net)
2026-08-18T01:26:30.6105999Z    Compiling spt-daemon v0.55.0 (C:\actions-runner\_work\spt-bs-core\spt-bs-core\crates\spt-daemon)
2026-08-18T01:26:53.2104463Z    Compiling spt v0.55.0 (C:\actions-runner\_work\spt-bs-core\spt-bs-core\crates\spt)
2026-08-18T01:27:58.8596914Z    Compiling xtask v0.55.0 (C:\actions-runner\_work\spt-bs-core\spt-bs-core\crates\xtask)
2026-08-18T01:30:41.0783501Z     Finished `test` profile [unoptimized + debuginfo] target(s) in 4m 45s
2026-08-18T01:30:50.6203253Z ────────────
2026-08-18T01:30:50.6203691Z  Nextest run ID a09a9ad9-0a3c-4449-af40-ae61f4f6107b with nextest profile: default
2026-08-18T01:30:50.6204215Z     Starting 2579 tests across 24 binaries (1 test and 167 binaries skipped)
2026-08-18T01:30:50.7050955Z         PASS [   0.032s] (   1/2579) mock-adapter::bin/capture-player tests::refuses_a_length_mismatch
2026-08-18T01:30:50.7096857Z         PASS [   0.032s] (   2/2579) spt::bin/spt accessview::tests::drill_matches_only_its_own_kind
2026-08-18T01:30:50.7097436Z         PASS [   0.041s] (   3/2579) spt::bin/spt accessview::tests::node_roster_lists_node_scope_entities_and_mode_exceptions
2026-08-18T01:30:50.7586227Z         PASS [   0.110s] (   4/2579) spt::bin/spt accessview::tests::a_pinned_open_renders_apart_from_a_default_open
2026-08-18T01:30:50.7732525Z         PASS [   0.123s] (   5/2579) spt::bin/spt api::auth::tests::missing_endpoint_is_no_endpoint
2026-08-18T01:30:50.7781117Z         PASS [   0.125s] (   6/2579) spt::bin/spt accessview::tests::target_roster_groups_types_and_counts_rules
2026-08-18T01:30:50.8073824Z         PASS [   0.158s] (   7/2579) mock-adapter::bin/capture-player tests::parses_a_well_formed_record
2026-08-18T01:30:50.8074663Z         PASS [   0.159s] (   8/2579) spt::bin/spt api::auth::tests::no_proof_is_refused
2026-08-18T01:30:50.8335945Z         PASS [   0.182s] (   9/2579) spt::bin/spt api::auth::tests::dead_owner_repin_still_rescues_a_non_custody_sid
2026-08-18T01:30:50.8557635Z         PASS [   0.202s] (  10/2579) spt::bin/spt api::auth::tests::an_unverifiable_live_owner_never_grants_a_repin
2026-08-18T01:30:50.8559244Z         PASS [   0.202s] (  11/2579) spt::bin/spt api::auth::tests::dead_owner_repin_refused_when_sid_is_a_psyche_custody_sid
2026-08-18T01:30:50.8727164Z         PASS [   0.216s] (  12/2579) spt::bin/spt api::auth::tests::live_owner_mismatch_still_refuses
2026-08-18T01:30:50.8728116Z         PASS [   0.224s] (  13/2579) spt::bin/spt api::auth::tests::pinned_to_dead_sid_mismatched_poll_repins
2026-08-18T01:30:50.8958997Z         PASS [   0.235s] (  14/2579) spt::bin/spt api::auth::tests::mints_distinct_nonempty_tokens
2026-08-18T01:30:50.8960071Z         PASS [   0.237s] (  15/2579) spt::bin/spt api::auth::tests::dead_owner_repin_refused_when_sid_owns_another_perch
2026-08-18T01:30:50.8969069Z         PASS [   0.248s] (  16/2579) spt::bin/spt api::auth::tests::a_recycled_owner_pid_no_longer_blocks_the_dead_owner_rescue
2026-08-18T01:30:50.8971400Z         PASS [   0.187s] (  17/2579) spt::bin/spt api::auth::tests::session_id_proof_authenticates
2026-08-18T01:30:50.9030904Z         PASS [   0.193s] (  18/2579) spt::bin/spt api::auth::tests::token_proof_authenticates
2026-08-18T01:30:50.9088368Z         PASS [   0.150s] (  19/2579) spt::bin/spt api::auth::tests::worker_missing_is_no_endpoint
2026-08-18T01:30:50.9192342Z         PASS [   0.209s] (  20/2579) spt::bin/spt api::auth::tests::token_auth_path_unchanged
2026-08-18T01:30:50.9307622Z         PASS [   0.157s] (  21/2579) spt::bin/spt api::auth::tests::worker_stored_sid_authenticates
2026-08-18T01:30:50.9310830Z         PASS [   0.158s] (  22/2579) spt::bin/spt api::auth::tests::worker_parent_current_sid_authenticates_after_rotation
2026-08-18T01:30:50.9941323Z         PASS [   0.187s] (  23/2579) spt::bin/spt api::auth::tests::worker_wrong_sid_and_token_only_refused
2026-08-18T01:30:50.9983604Z         PASS [   0.190s] (  24/2579) spt::bin/spt api::auth::tests::wrong_token_and_wrong_session_refused
2026-08-18T01:30:50.9986163Z         PASS [   0.148s] (  25/2579) spt::bin/spt api::delivery::tests::idle_busy_transitions_manage_sentinels
2026-08-18T01:30:51.0101116Z         PASS [   0.159s] (  26/2579) spt::bin/spt api::delivery::tests::echo_gate_explicit_toggle
2026-08-18T01:30:51.0105765Z         PASS [   0.180s] (  27/2579) spt::bin/spt api::delivery::tests::an_undated_state_is_dated_by_a_non_edge_report
2026-08-18T01:30:51.0171634Z         PASS [   0.131s] (  28/2579) spt::bin/spt api::delivery::tests::inject_resolution_drops_pty_defaults_hook
2026-08-18T01:30:51.0196162Z         PASS [   0.136s] (  29/2579) spt::bin/spt api::delivery::tests::inject_all_pty_falls_back_to_hook
2026-08-18T01:30:51.0407113Z         PASS [   0.166s] (  30/2579) spt::bin/spt api::delivery::tests::idle_no_gate_does_not_arm_gate
2026-08-18T01:30:51.1185565Z         PASS [   0.121s] (  31/2579) spt::bin/spt api::engineroom::tests::a_refresh_adopts_only_a_real_divergence
2026-08-18T01:30:51.1199009Z         PASS [   0.122s] (  32/2579) spt::bin/spt api::engineroom::tests::an_admin_code_verifies_across_the_ceremony_window_only
2026-08-18T01:30:51.1227838Z         PASS [   0.129s] (  33/2579) spt::bin/spt api::engineroom::tests::a_pin_is_not_a_clear
2026-08-18T01:30:51.1373567Z         PASS [   0.241s] (  34/2579) spt::bin/spt api::delivery::tests::only_a_real_state_edge_stamps_the_transition_instant
2026-08-18T01:30:51.1735268Z         PASS [   0.156s] (  35/2579) spt::bin/spt api::engineroom::tests::subnet_authority_is_the_empowerment_not_the_gate
2026-08-18T01:30:51.1855600Z         PASS [   0.165s] (  36/2579) spt::bin/spt api::engineroom::tests::the_perch_minting_verbs_admit_the_reserved_id_only_as_a_completion
2026-08-18T01:30:51.1879025Z         PASS [   0.177s] (  37/2579) spt::bin/spt api::engineroom::tests::the_gate_admits_only_the_reserved_id_provisioned_and_authenticated
2026-08-18T01:30:51.2026730Z         PASS [   0.084s] (  38/2579) spt::bin/spt api::engineroom::tests::the_unset_echo_names_what_governs_next
2026-08-18T01:30:51.2080153Z         PASS [   0.086s] (  39/2579) spt::bin/spt api::engineroom::tests::the_written_node_mode_is_the_one_the_chain_reads
2026-08-18T01:30:51.2251669Z         PASS [   0.206s] (  40/2579) spt::bin/spt api::engineroom::tests::the_surface_mode_verb_refuses_a_caller_that_is_not_the_engine_room
2026-08-18T01:30:51.2719546Z         PASS [   0.232s] (  41/2579) spt::bin/spt api::engineroom::tests::the_surface_mode_verb_refuses_an_unminted_surface_and_writes_nothing
2026-08-18T01:30:51.2920031Z         PASS [   0.417s] (  42/2579) spt::bin/spt api::delivery::tests::idle_drain_peek_returns_non_deferred_rows_only
2026-08-18T01:30:51.3328695Z         PASS [   0.142s] (  43/2579) spt::bin/spt api::reporting::tests::boundary_missing_perch_refused
2026-08-18T01:30:51.3417529Z         PASS [   0.060s] (  44/2579) spt::bin/spt api::reporting::tests::capability_lists_hostable_types
2026-08-18T01:30:51.4256889Z         PASS [   0.471s] (  45/2579) spt::bin/spt api::delivery::tests::poll_only_drains_when_hook_method_present
2026-08-18T01:30:51.4485979Z         PASS [   0.240s] (  46/2579) spt::bin/spt api::reporting::tests::boundary_refuses_rotating_onto_a_psyche_custody_sid
2026-08-18T01:30:51.4496213Z         PASS [   0.527s] (  47/2579) spt::bin/spt api::delivery::tests::poll_drains_non_deferred_by_default
2026-08-18T01:30:51.5808280Z         PASS [   0.666s] (  48/2579) spt::bin/spt api::delivery::tests::poll_drain_holds_deferred_while_resting_and_releases_once_on_wake
2026-08-18T01:30:51.5809225Z         PASS [   0.234s] (  49/2579) spt::bin/spt api::reporting::tests::digest_entry_validates_and_appends_to_digest_log
2026-08-18T01:30:51.5810128Z         PASS [   0.442s] (  50/2579) spt::bin/spt api::reporting::tests::a_non_engine_room_boundary_never_moves_the_seats_empowerment
2026-08-18T01:30:51.5811067Z         PASS [   0.666s] (  51/2579) spt::bin/spt api::delivery::tests::poll_drain_suppresses_idle_only_which_reaches_the_relay
2026-08-18T01:30:51.6995433Z         PASS [   0.480s] (  52/2579) spt::bin/spt api::reporting::tests::boundary_rebinds_keeping_anchor
2026-08-18T01:30:51.6998609Z         PASS [   0.774s] (  53/2579) spt::bin/spt api::delivery::tests::poll_drain_validates_notify_copies_against_their_rows
2026-08-18T01:30:51.7072224Z         PASS [   0.530s] (  54/2579) spt::bin/spt api::reporting::tests::boundary_appends_to_the_session_ledger
2026-08-18T01:30:51.7074828Z         PASS [   0.768s] (  55/2579) spt::bin/spt api::engineroom::tests::a_non_engine_room_attempt_never_touches_the_empower_ledger
2026-08-18T01:30:51.7094983Z         PASS [   0.357s] (  56/2579) spt::bin/spt api::reporting::tests::driven_by_reads_daemon_marker
2026-08-18T01:30:51.7097143Z         PASS [   0.429s] (  57/2579) spt::bin/spt api::reporting::tests::boundary_with_a_fresh_sid_is_unaffected_by_the_squat_guard
2026-08-18T01:30:51.7192612Z         PASS [   0.579s] (  58/2579) spt::bin/spt api::reporting::tests::a_rotated_away_session_id_cannot_resurrect_a_dropped_empowerment
2026-08-18T01:30:51.8102720Z         PASS [   0.404s] (  59/2579) spt::bin/spt api::reporting::tests::endpoint_info_activity_word_tracks_the_idle_sentinel
2026-08-18T01:30:51.8241451Z         PASS [   0.378s] (  60/2579) spt::bin/spt api::reporting::tests::endpoint_info_attached_node_from_honest_stamps
2026-08-18T01:30:51.8278720Z         PASS [   0.601s] (  61/2579) spt::bin/spt api::reporting::tests::boundary_resurfaces_undismissed_notifs
2026-08-18T01:30:51.8501536Z         PASS [   0.667s] (  62/2579) spt::bin/spt api::reporting::tests::boundary_injects_deferred_shell_context
2026-08-18T01:30:51.9001512Z         PASS [   0.454s] (  63/2579) spt::bin/spt api::reporting::tests::endpoint_info_attached_node_self_attributes_own_node_driver
2026-08-18T01:30:51.9505811Z         PASS [   0.387s] (  64/2579) spt::bin/spt api::reporting::tests::endpoint_info_json_always_carries_an_activity_word
2026-08-18T01:30:52.0748044Z         PASS [   0.511s] (  65/2579) spt::bin/spt api::reporting::tests::endpoint_info_reports_and_refuses
2026-08-18T01:30:52.2225430Z         PASS [   0.658s] (  66/2579) spt::bin/spt api::reporting::tests::env_aliases_resolved_from_manifest
2026-08-18T01:30:52.4658775Z         PASS [   0.897s] (  67/2579) spt::bin/spt api::reporting::tests::erase_unregisters_regardless_of_liveness
2026-08-18T01:30:52.5618285Z         PASS [   0.879s] (  68/2579) spt::bin/spt api::reporting::tests::filedrops_are_fixed_named_files
2026-08-18T01:30:52.7364121Z         PASS [   1.037s] (  69/2579) spt::bin/spt api::reporting::tests::hint_once_per_session_one_per_message
2026-08-18T01:30:52.7364823Z         PASS [   1.038s] (  70/2579) spt::bin/spt api::reporting::tests::history_log_appends
2026-08-18T01:30:52.7955946Z         PASS [   1.066s] (  71/2579) spt::bin/spt api::reporting::tests::misplaced_drop_is_still_found_once_the_anchor_is_correct
2026-08-18T01:30:52.7956721Z         PASS [   1.089s] (  72/2579) spt::bin/spt api::reporting::tests::presence_records_endpoint
2026-08-18T01:30:52.8402308Z         PASS [   0.371s] (  73/2579) spt::bin/spt api::tests::ctx_manifest_unregistered_no_manifest_is_none_not_fatal
2026-08-18T01:30:52.8512276Z         PASS [   0.894s] (  74/2579) spt::bin/spt api::tests::adapter_is_optional
2026-08-18T01:30:52.8513029Z         PASS [   0.773s] (  75/2579) spt::bin/spt api::tests::ctx_manifest_override_wins_when_manifest_present
2026-08-18T01:30:52.8618129Z         PASS [   0.959s] (  76/2579) spt::bin/spt api::startup::tests::a_dead_binder_pid_proves_nothing_and_never_drops_the_stamp
2026-08-18T01:30:52.8628892Z         PASS [   0.142s] (  77/2579) spt::bin/spt api::tests::state_value_is_validated
2026-08-18T01:30:52.8960589Z         PASS [   0.162s] (  78/2579) spt::bin/spt api::tests::surface_parses
2026-08-18T01:30:52.9006727Z         PASS [   0.042s] (  79/2579) spt::bin/spt api::startup::tests::a_dead_relays_capability_stamp_is_not_resurrected_by_a_listener_rebind
2026-08-18T01:30:52.9242366Z         PASS [   0.361s] (  80/2579) spt::bin/spt api::tests::load_manifest_resolves_composite_adapter_option
2026-08-18T01:30:52.9353082Z         PASS [   0.713s] (  81/2579) spt::bin/spt api::tests::ctx_manifest_resolves_from_registry_when_manifest_absent
2026-08-18T01:30:52.9356840Z         PASS [   1.112s] (  82/2579) spt::bin/spt api::reporting::tests::session_end_soft_preserves_state
2026-08-18T01:30:53.0314329Z         PASS [   1.226s] (  83/2579) spt::bin/spt api::reporting::tests::session_end_erase_wipes_childless_perch
2026-08-18T01:30:53.0670956Z         PASS [   0.186s] (  84/2579) spt::bin/spt api::worker::tests::worker_start_nests_under_parent
2026-08-18T01:30:53.0672431Z         PASS [   0.286s] (  85/2579) spt::bin/spt api::worker::tests::cascade_guard_tracks_live_children
2026-08-18T01:30:53.0673135Z         PASS [   1.228s] (  86/2579) spt::bin/spt api::reporting::tests::soft_end_preserves_a_live_listeners_address
2026-08-18T01:30:53.1335981Z         PASS [   0.262s] (  87/2579) spt::bin/spt api::worker::tests::worker_start_mints_id_stores_parent_sid_and_metadata
2026-08-18T01:30:53.1336949Z         PASS [   0.324s] (  88/2579) spt::bin/spt api::worker::tests::guard_clears_only_when_all_children_stopped
2026-08-18T01:30:53.1356135Z         PASS [   0.217s] (  89/2579) spt::bin/spt api::worker::tests::worker_start_registration_sid_falls_back_to_presented
2026-08-18T01:30:53.1357157Z         PASS [   1.265s] (  90/2579) spt::bin/spt api::reporting::tests::soft_end_still_cleans_a_dead_listeners_address
2026-08-18T01:30:53.1360556Z         PASS [   0.193s] (  91/2579) spt::bin/spt cli::lifecycle_verb_decisions::remembered_defaults_prefer_the_newest_row_field_by_field
2026-08-18T01:30:53.1617934Z         PASS [   0.224s] (  92/2579) spt::bin/spt cli::lifecycle_verb_decisions::the_adapter_precedence_is_flag_then_endpoint_then_a_sole_installed_one
2026-08-18T01:30:53.1639628Z         PASS [   0.224s] (  93/2579) spt::bin/spt cli::lifecycle_verb_decisions::the_go_ladder_takes_the_ratified_rung
2026-08-18T01:30:53.1640690Z         PASS [   0.130s] (  94/2579) spt::bin/spt cli::reserved_id_tests::endpoint_run_refuses_the_reserved_id_and_saves_nothing
2026-08-18T01:30:53.1744396Z         PASS [   0.062s] (  95/2579) spt::bin/spt cli::retired_verb_pre_scan::the_pre_scan_reads_the_verb_position_only
2026-08-18T01:30:53.1745173Z         PASS [   0.060s] (  96/2579) spt::bin/spt cli::run_home_tests::order_by_mru_orders_guidance
2026-08-18T01:30:53.1748200Z         PASS [   0.119s] (  97/2579) spt::bin/spt cli::resume_resolution_tests::resume_never_feeds_a_provisional
2026-08-18T01:30:53.1764211Z         PASS [   0.064s] (  98/2579) spt::bin/spt cli::retired_verb_pre_scan::the_retired_verb_refuses_with_a_pointer_a_generic_error_cannot_fake
2026-08-18T01:30:53.1764963Z         PASS [   0.061s] (  99/2579) spt::bin/spt cli::run_home_tests::run_home_resolution_matrix
2026-08-18T01:30:53.1829931Z         PASS [   0.067s] ( 100/2579) spt::bin/spt cli::run_on_live_tests::run_on_live_never_duplicates_and_create_conflicts
2026-08-18T01:30:53.1927617Z         PASS [   0.033s] ( 101/2579) spt::bin/spt cli::tests::a_mint_captures_its_declared_mode_and_nothing_else
2026-08-18T01:30:53.2064245Z         PASS [   0.034s] ( 102/2579) spt::bin/spt cli::tests::a_notfound_lands_locally_only_when_the_target_is_an_endpoint_here
2026-08-18T01:30:53.2163704Z         PASS [   0.042s] ( 103/2579) spt::bin/spt cli::tests::a_one_way_approval_hands_over_a_reverse_command_that_parses
2026-08-18T01:30:53.2170480Z         PASS [   0.041s] ( 104/2579) spt::bin/spt cli::tests::a_remote_send_receive_claims_only_what_it_can_deliver
2026-08-18T01:30:53.2808352Z         PASS [   0.098s] ( 105/2579) spt::bin/spt cli::tests::a_reply_carried_request_is_not_stamped_as_a_first_order_knock
2026-08-18T01:30:53.2848988Z         PASS [   0.092s] ( 106/2579) spt::bin/spt cli::tests::a_retired_flag_names_what_replaced_it
2026-08-18T01:30:53.3011344Z         PASS [   0.095s] ( 107/2579) spt::bin/spt cli::tests::a_row_without_a_node_says_so_and_one_with_a_node_shows_it
2026-08-18T01:30:53.3115603Z         PASS [   1.609s] ( 108/2579) spt::bin/spt api::reporting::tests::session_end_erase_reaps_stale_worker_then_proceeds
2026-08-18T01:30:53.3117060Z         PASS [   1.594s] ( 109/2579) spt::bin/spt api::reporting::tests::session_end_erase_refused_with_live_children
2026-08-18T01:30:53.3218401Z         PASS [   0.270s] ( 110/2579) spt::bin/spt cli::reserved_id_tests::the_lifecycle_verbs_refuse_their_preconditions
2026-08-18T01:30:53.3232821Z         PASS [   0.107s] ( 111/2579) spt::bin/spt cli::tests::a_rule_describes_itself_in_plain_words
2026-08-18T01:30:53.3422843Z         PASS [   0.121s] ( 112/2579) spt::bin/spt cli::tests::a_sealed_codes_subnet_is_chosen_and_never_guessed
2026-08-18T01:30:53.3925152Z         PASS [   0.210s] ( 113/2579) spt::bin/spt cli::tests::a_local_hit_never_asks_the_broker
2026-08-18T01:30:53.3932215Z         PASS [   0.084s] ( 114/2579) spt::bin/spt cli::tests::a_status_row_reads_held_over_running_and_carries_its_evidence
2026-08-18T01:30:53.3933016Z         PASS [   0.203s] ( 115/2579) spt::bin/spt cli::tests::a_non_attributable_bake_needs_the_acknowledgment_and_keeps_it
2026-08-18T01:30:53.3938291Z         PASS [   0.214s] ( 116/2579) spt::bin/spt cli::tests::a_minted_sealed_code_is_the_one_that_opens_to_its_record
2026-08-18T01:30:53.3940626Z         PASS [   0.096s] ( 117/2579) spt::bin/spt cli::tests::a_sender_rule_on_a_non_attributable_surface_is_refused
2026-08-18T01:30:53.4355998Z         PASS [   0.588s] ( 118/2579) spt::bin/spt api::worker::tests::worker_poll_holds_deferred_while_resting
2026-08-18T01:30:53.4943720Z         PASS [   0.122s] ( 119/2579) spt::bin/spt cli::tests::access_subcommands_parse
2026-08-18T01:30:53.4944809Z         PASS [   0.637s] ( 120/2579) spt::bin/spt api::worker::tests::worker_poll_drains_spool
2026-08-18T01:30:53.4945453Z         PASS [   0.177s] ( 121/2579) spt::bin/spt cli::tests::a_subnet_fork_grant_names_the_members_that_cannot_resolve
2026-08-18T01:30:53.4946193Z         PASS [   0.170s] ( 122/2579) spt::bin/spt cli::tests::adapter_add_transport_flags_parse
2026-08-18T01:30:53.4946817Z         PASS [   0.125s] ( 123/2579) spt::bin/spt cli::tests::adapter_has_live_endpoint_detects_matching_live_perch
2026-08-18T01:30:53.5183720Z         PASS [   0.214s] ( 124/2579) spt::bin/spt cli::tests::a_subcommand_name_beats_the_bare_target
2026-08-18T01:30:53.5235329Z         PASS [   0.147s] ( 125/2579) spt::bin/spt cli::tests::adapter_name_validation_flags_every_unknown
2026-08-18T01:30:53.6235844Z         PASS [   0.213s] ( 126/2579) spt::bin/spt cli::tests::adapter_names_comma_list_parses_and_refuses_empties
2026-08-18T01:30:53.6429699Z         PASS [   0.127s] ( 127/2579) spt::bin/spt cli::tests::adapter_update_notice_absent_when_no_message
2026-08-18T01:30:53.7057795Z         PASS [   0.159s] ( 128/2579) spt::bin/spt cli::tests::adapter_translate_proof_parses
2026-08-18T01:30:53.7059219Z         PASS [   0.286s] ( 129/2579) spt::bin/spt cli::tests::adapter_has_live_endpoint_false_for_other_or_dead
2026-08-18T01:30:53.7062480Z         PASS [   0.175s] ( 130/2579) spt::bin/spt cli::tests::adapter_update_install_dir_is_registered_source_dir_not_repo_name
2026-08-18T01:30:53.7063401Z         PASS [   0.363s] ( 131/2579) spt::bin/spt cli::tests::a_wedged_probe_costs_one_ceiling_and_reads_unknown_not_offline
2026-08-18T01:30:53.7064004Z         PASS [   0.242s] ( 132/2579) spt::bin/spt cli::tests::adapter_profile_verbs_local_only
2026-08-18T01:30:53.7152393Z         PASS [   0.240s] ( 133/2579) spt::bin/spt cli::tests::adapter_subcommands_parse
2026-08-18T01:30:53.7179256Z         PASS [   0.272s] ( 134/2579) spt::bin/spt cli::tests::adapter_string_verbs
2026-08-18T01:30:53.7180081Z         PASS [   0.817s] ( 135/2579) spt::bin/spt api::startup::tests::a_listener_over_a_dead_pty_is_not_offlined_by_the_liveness_reconcile
2026-08-18T01:30:53.7619500Z         PASS [   0.197s] ( 136/2579) spt::bin/spt cli::tests::adapter_update_notice_renders_declared_message_markdown
2026-08-18T01:30:53.7670194Z         PASS [   0.123s] ( 137/2579) spt::bin/spt cli::tests::adapter_use_sets_and_clears_pointer
2026-08-18T01:30:53.7848459Z         PASS [   0.109s] ( 138/2579) spt::bin/spt cli::tests::all_hidden_this_node_suppresses_no_perches_marker
2026-08-18T01:30:53.7948357Z         PASS [   0.204s] ( 139/2579) spt::bin/spt cli::tests::adapter_update_summary_and_exit_aggregate_isolated_failures
2026-08-18T01:30:53.7949034Z         PASS [   0.142s] ( 140/2579) spt::bin/spt cli::tests::adapter_version_parses
2026-08-18T01:30:53.7965856Z         PASS [   0.121s] ( 141/2579) spt::bin/spt cli::tests::already_applied_message_reads_up_to_date_no_restart
2026-08-18T01:30:53.8081435Z         PASS [   0.136s] ( 142/2579) spt::bin/spt cli::tests::agent_ground_describes_itself_exactly_as_the_ceremony_always_did
2026-08-18T01:30:53.8370690Z         PASS [   0.164s] ( 143/2579) spt::bin/spt cli::tests::adapter_version_surfaces_declared_adapter_version
2026-08-18T01:30:53.8422655Z         PASS [   0.115s] ( 144/2579) spt::bin/spt cli::tests::an_addressed_target_is_local_only_when_its_node_half_names_this_node
2026-08-18T01:30:53.8926204Z         PASS [   0.176s] ( 145/2579) spt::bin/spt cli::tests::an_approval_binds_the_subject_the_knocks_origin_implies
2026-08-18T01:30:53.9189461Z         PASS [   0.124s] ( 146/2579) spt::bin/spt cli::tests::an_undelivered_receipt_reports_only_the_receipt
2026-08-18T01:30:53.9470399Z         PASS [   0.163s] ( 147/2579) spt::bin/spt cli::tests::an_empty_unlisted_set_renders_no_heading_at_all
2026-08-18T01:30:53.9514487Z         PASS [   0.218s] ( 148/2579) spt::bin/spt cli::tests::an_empty_stored_surface_list_still_means_every_surface
2026-08-18T01:30:53.9533421Z         PASS [   0.144s] ( 149/2579) spt::bin/spt cli::tests::an_excluded_knock_is_neither_a_landing_nor_a_wire_refusal
2026-08-18T01:30:53.9609112Z         PASS [   0.147s] ( 150/2579) spt::bin/spt cli::tests::any_single_evidence_source_is_enough_and_only_nothing_refuses
2026-08-18T01:30:53.9609767Z         PASS [   0.159s] ( 151/2579) spt::bin/spt cli::tests::answering_verbs_declare_no_directionality
2026-08-18T01:30:53.9666940Z         PASS [   0.248s] ( 152/2579) spt::bin/spt api::startup::tests::a_live_owner_whose_birth_matches_still_refuses_the_bind
2026-08-18T01:30:54.0663852Z         PASS [   0.128s] ( 153/2579) spt::bin/spt cli::tests::applied_message_appends_restart_required_notice
2026-08-18T01:30:54.0666268Z         PASS [   0.207s] ( 154/2579) spt::bin/spt cli::tests::api_adapter_flag_is_group_level_not_post_subcommand
2026-08-18T01:30:54.0666951Z         PASS [   0.217s] ( 155/2579) spt::bin/spt cli::tests::api_listen_accepts_session_id_flag
2026-08-18T01:30:54.0667517Z         PASS [   0.115s] ( 156/2579) spt::bin/spt cli::tests::bare_spt_parses_to_none
2026-08-18T01:30:54.0776259Z         PASS [   0.125s] ( 157/2579) spt::bin/spt cli::tests::bare_tty_guard
2026-08-18T01:30:54.0871909Z         PASS [   0.168s] ( 158/2579) spt::bin/spt cli::tests::applied_message_renders_semver_or_counter_fallback_and_states_applied
2026-08-18T01:30:54.0999887Z         PASS [   0.058s] ( 159/2579) spt::bin/spt cli::tests::broker_image_line_reports_without_warning_or_remedy
2026-08-18T01:30:54.1000560Z         PASS [   0.137s] ( 160/2579) spt::bin/spt cli::tests::bare_update_parses_composite_flags
2026-08-18T01:30:54.1001101Z         PASS [   0.079s] ( 161/2579) spt::bin/spt cli::tests::both_knock_answer_surfaces_take_a_monic
2026-08-18T01:30:54.1344774Z         PASS [   0.188s] ( 162/2579) spt::bin/spt cli::tests::apply_user_msg_gate_local_origination
2026-08-18T01:30:54.1687724Z         PASS [   0.199s] ( 163/2579) spt::bin/spt api::startup::tests::a_recycled_owner_pid_no_longer_refuses_the_bind
2026-08-18T01:30:54.2387170Z         PASS [   0.160s] ( 164/2579) spt::bin/spt cli::tests::classify_multiplatform_captures_only_known_triples
2026-08-18T01:30:54.2738414Z         PASS [   0.226s] ( 165/2579) spt::bin/spt cli::tests::classify_fetch_reject_matrix
2026-08-18T01:30:54.2817033Z         PASS [   0.190s] ( 166/2579) spt::bin/spt cli::tests::cli_send_stamps_cli_at_node_origin
2026-08-18T01:30:54.3140739Z         PASS [   0.259s] ( 167/2579) spt::bin/spt cli::tests::classify_flat_archive_never_misfires
2026-08-18T01:30:54.3653162Z         PASS [   0.270s] ( 168/2579) spt::bin/spt cli::tests::composite_plans_core_first_and_core_only_skips_adapters
2026-08-18T01:30:54.3766334Z         PASS [   0.285s] ( 169/2579) spt::bin/spt cli::tests::connection_lines_net_less_hides_stale_heartbeat
2026-08-18T01:30:54.3936752Z         PASS [   0.156s] ( 170/2579) spt::bin/spt cli::tests::create_mints_two_distinct_keys_and_records_the_mode
2026-08-18T01:30:54.4061144Z         PASS [   0.132s] ( 171/2579) spt::bin/spt cli::tests::create_mode_is_never_preselected
2026-08-18T01:30:54.4191571Z         PASS [   0.291s] ( 172/2579) spt::bin/spt cli::tests::create_existing_name_is_usage_error
2026-08-18T01:30:54.4366490Z         PASS [   0.068s] ( 173/2579) spt::bin/spt cli::tests::create_not_elevated_refuses_without_saving
2026-08-18T01:30:54.4420366Z         PASS [   0.121s] ( 174/2579) spt::bin/spt cli::tests::create_new_mints_shows_and_requests_save
2026-08-18T01:30:54.4527062Z         PASS [   0.351s] ( 175/2579) spt::bin/spt cli::tests::coordinator_image_line_is_the_only_stale_warning
2026-08-18T01:30:54.4528663Z         PASS [   0.073s] ( 176/2579) spt::bin/spt cli::tests::create_prints_joining_material_when_elevated
2026-08-18T01:30:54.4937943Z         PASS [   0.200s] ( 177/2579) spt::bin/spt cli::tests::create_new_existing_name_is_usage_error
2026-08-18T01:30:54.5125799Z         PASS [   1.142s] ( 178/2579) spt::bin/spt cli::tests::adapter_digest_proof_gates_on_drops
2026-08-18T01:30:54.5306894Z         PASS [   0.112s] ( 179/2579) spt::bin/spt cli::tests::cross_node_after_filters_a_sealed_turn_exactly_like_the_local_path
2026-08-18T01:30:54.5318044Z         PASS [   0.367s] ( 180/2579) spt::bin/spt api::startup::tests::a_recycled_relay_pid_is_fixed_too_so_the_role_gate_is_not_carrying_this
2026-08-18T01:30:54.5487150Z         PASS [   0.154s] ( 181/2579) spt::bin/spt cli::tests::create_provisions_the_admin_key_and_show_code_never_does
2026-08-18T01:30:54.5727781Z         PASS [   0.155s] ( 182/2579) spt::bin/spt cli::tests::daemon_offline_hint_only_when_down
2026-08-18T01:30:54.5728483Z         PASS [   0.144s] ( 183/2579) spt::bin/spt cli::tests::daemon_refresh_verb_parses
2026-08-18T01:30:54.5768462Z         PASS [   0.128s] ( 184/2579) spt::bin/spt cli::tests::daemonless_apply_message_points_at_finish_or_start
2026-08-18T01:30:54.5847777Z         PASS [   0.072s] ( 185/2579) spt::bin/spt cli::tests::digest_flag_defaults
2026-08-18T01:30:54.5882943Z         PASS [   0.138s] ( 186/2579) spt::bin/spt cli::tests::deferred_elevation_gate_matrix
2026-08-18T01:30:54.5907977Z         PASS [   0.157s] ( 187/2579) spt::bin/spt cli::tests::daemon_subcommands_parse
2026-08-18T01:30:54.5970989Z         PASS [   0.117s] ( 188/2579) spt::bin/spt cli::tests::digest_cursor_flags_parse
2026-08-18T01:30:54.5972031Z         PASS [   0.076s] ( 189/2579) spt::bin/spt cli::tests::digest_human_path_keeps_the_stderr_trailer
2026-08-18T01:30:54.6612072Z         PASS [   0.110s] ( 190/2579) spt::bin/spt cli::tests::digest_json_carries_version_and_leaves_stderr_clean
2026-08-18T01:30:54.6848462Z         PASS [   0.110s] ( 191/2579) spt::bin/spt cli::tests::empty_store_no_flag_guides_to_pair_or_create
2026-08-18T01:30:54.7098742Z         PASS [   0.133s] ( 192/2579) spt::bin/spt cli::tests::endpoint_caller_is_denied_and_a_human_caller_is_not
2026-08-18T01:30:54.7099431Z         PASS [   0.119s] ( 193/2579) spt::bin/spt cli::tests::endpoint_row_json_endpoint_type_is_additive
2026-08-18T01:30:54.7208551Z         PASS [   0.061s] ( 194/2579) spt::bin/spt cli::tests::engine_room_ceremony_decision_table
2026-08-18T01:30:54.7209688Z         PASS [   0.147s] ( 195/2579) spt::bin/spt cli::tests::digest_json_predates_path_still_carries_version
2026-08-18T01:30:54.7223131Z         PASS [   0.038s] ( 196/2579) spt::bin/spt cli::tests::engine_room_purge_resets_under_elevation_and_refuses_without_it
2026-08-18T01:30:54.7331245Z         PASS [   0.143s] ( 197/2579) spt::bin/spt cli::tests::endpoint_role_parses
2026-08-18T01:30:54.7548402Z         PASS [   1.414s] ( 198/2579) spt::bin/spt cli::tests::adapter_digest_proof_fills_session_id_key
2026-08-18T01:30:54.7550849Z         PASS [   0.160s] ( 199/2579) spt::bin/spt cli::tests::endpoint_subcommands_parse
2026-08-18T01:30:54.7708808Z         PASS [   0.837s] ( 200/2579) spt::bin/spt cli::tests::apply_release_crc_swap_only_swaps_changed
2026-08-18T01:30:54.7963054Z         PASS [   0.086s] ( 201/2579) spt::bin/spt cli::tests::every_mint_persist_site_asks_the_shared_probe
2026-08-18T01:30:54.8399405Z         PASS [   0.073s] ( 202/2579) spt::bin/spt cli::tests::fetch_reject_action_apply_decision
2026-08-18T01:30:54.8639896Z         PASS [   0.269s] ( 203/2579) spt::bin/spt cli::tests::endpoint_stop_marks_offline
2026-08-18T01:30:54.8745457Z         PASS [   0.153s] ( 204/2579) spt::bin/spt cli::tests::every_send_outcome_is_answered_by_exactly_one_renderer
2026-08-18T01:30:54.8827901Z         PASS [   0.351s] ( 205/2579) spt::bin/spt api::startup::tests::api_bind_admits_the_reserved_id_only_as_a_bring_ups_completion
2026-08-18T01:30:54.9137940Z         PASS [   0.194s] ( 206/2579) spt::bin/spt cli::tests::every_read_status_command_accepts_the_global_json_flag
2026-08-18T01:30:54.9431592Z         PASS [   0.223s] ( 207/2579) spt::bin/spt cli::tests::every_node_subcommand_parses_identically_under_the_daemon_alias
2026-08-18T01:30:54.9434735Z         PASS [   0.233s] ( 208/2579) spt::bin/spt cli::tests::escalation_choice_parses_fail_closed
2026-08-18T01:30:55.0093172Z         PASS [   0.144s] ( 209/2579) spt::bin/spt cli::tests::finish_message_states_fully_live_no_manual_restart
2026-08-18T01:30:55.0093823Z         PASS [   0.168s] ( 210/2579) spt::bin/spt cli::tests::filter_after_predates_window_returns_full
2026-08-18T01:30:55.0309839Z         PASS [   0.117s] ( 211/2579) spt::bin/spt cli::tests::gh_download_command_no_tag_omits_tag
2026-08-18T01:30:55.0661300Z         PASS [   0.111s] ( 212/2579) spt::bin/spt cli::tests::gh_download_command_with_tag_shape
2026-08-18T01:30:55.0662005Z         PASS [   0.258s] ( 213/2579) spt::bin/spt cli::tests::filter_after_excludes_at_or_below_cursor
2026-08-18T01:30:55.0665711Z         PASS [   0.111s] ( 214/2579) spt::bin/spt cli::tests::gh_failure_classes_render_os_correct_hints
2026-08-18T01:30:55.2007203Z         PASS [   0.190s] ( 215/2579) spt::bin/spt cli::tests::gh_release_version_compare_decision
2026-08-18T01:30:55.2770123Z         PASS [   0.269s] ( 216/2579) spt::bin/spt cli::tests::gh_version_command_shape
2026-08-18T01:30:55.2968392Z         PASS [   0.263s] ( 217/2579) spt::bin/spt cli::tests::grant_subcommands_parse
2026-08-18T01:30:55.4110463Z         PASS [   0.651s] ( 218/2579) spt::bin/spt cli::tests::extract_multiplatform_missing_my_triple_is_typed_rejection
2026-08-18T01:30:55.4111238Z         PASS [   0.674s] ( 219/2579) spt::bin/spt cli::tests::extract_legacy_flat_stays_flat
2026-08-18T01:30:55.4690394Z         PASS [   0.691s] ( 220/2579) spt::bin/spt cli::tests::extract_multiplatform_places_shared_root_and_flattens_my_triple
2026-08-18T01:30:55.4971565Z         PASS [   0.441s] ( 221/2579) spt::bin/spt cli::tests::help_groups_cover_every_command
2026-08-18T01:30:55.5238241Z         PASS [   0.466s] ( 222/2579) spt::bin/spt cli::tests::hot_path_flat_and_moved_verbs_gone
2026-08-18T01:30:55.6343597Z         PASS [   0.577s] ( 223/2579) spt::bin/spt cli::tests::how_to_topics_cover_ready_and_send
2026-08-18T01:30:55.6394970Z         PASS [   0.362s] ( 224/2579) spt::bin/spt cli::tests::inbound_verdict_rides_the_json_in_every_state_including_ok
2026-08-18T01:30:55.6413291Z         PASS [   0.442s] ( 225/2579) spt::bin/spt cli::tests::inbound_json_speaks_in_the_two_states_the_human_view_is_silent_in
2026-08-18T01:30:55.7093539Z         PASS [   2.622s] ( 226/2579) spt::bin/spt cli::reserved_id_tests::rename_into_the_reserved_id_is_refused
2026-08-18T01:30:55.7346544Z         PASS [   0.329s] ( 227/2579) spt::bin/spt cli::tests::instance_rows_palette_and_align
2026-08-18T01:30:55.7564545Z         PASS [   0.302s] ( 228/2579) spt::bin/spt cli::tests::instance_rows_project_column
2026-08-18T01:30:55.7979418Z         PASS [   0.300s] ( 229/2579) spt::bin/spt cli::tests::invalid_usage_errors
2026-08-18T01:30:55.8207827Z         PASS [   0.281s] ( 230/2579) spt::bin/spt cli::tests::join_gate_refuses_without_confirmed_elevation
2026-08-18T01:30:55.8214147Z         PASS [   0.515s] ( 231/2579) spt::bin/spt cli::tests::install_place_is_idempotent_and_path_block_detected
2026-08-18T01:30:55.8219872Z         PASS [   0.177s] ( 232/2579) spt::bin/spt cli::tests::json_activity_key_is_local_only_and_skips_when_unknown
2026-08-18T01:30:55.8220895Z         PASS [   0.181s] ( 233/2579) spt::bin/spt cli::tests::json_activity_words_come_from_the_shared_vocabulary_source
2026-08-18T01:30:55.8443259Z         PASS [   0.165s] ( 234/2579) spt::bin/spt cli::tests::json_project_field_skip_if_none
2026-08-18T01:30:55.8714994Z         PASS [   0.221s] ( 235/2579) spt::bin/spt cli::tests::json_payload_rides_as_attr_alongside_body
2026-08-18T01:30:55.8715747Z         PASS [   0.468s] ( 236/2579) spt::bin/spt cli::tests::install_platform_check_gates_stamp_and_host_arch
2026-08-18T01:30:55.8716641Z         PASS [   0.137s] ( 237/2579) spt::bin/spt cli::tests::knock_surfaces_speaks_the_tables_vocabulary_and_refuses_the_rest
2026-08-18T01:30:55.8859710Z         PASS [   0.137s] ( 238/2579) spt::bin/spt cli::tests::local_dtos_carry_host_error_and_omit_it_when_clean
2026-08-18T01:30:55.8919415Z         PASS [   0.094s] ( 239/2579) spt::bin/spt cli::tests::malformed_tuple_flags_refuse_with_a_usable_diagnostic
2026-08-18T01:30:55.8964872Z         PASS [   0.084s] ( 240/2579) spt::bin/spt cli::tests::new_code_carries_the_acknowledgment_and_the_subnet_through_the_router
2026-08-18T01:30:55.8983458Z         PASS [   1.014s] ( 241/2579) spt::bin/spt api::startup::tests::api_listen_admits_the_reserved_id_only_as_a_bring_ups_completion
2026-08-18T01:30:55.9037005Z         PASS [   0.103s] ( 242/2579) spt::bin/spt cli::tests::monic_verbs_parse
2026-08-18T01:30:55.9049003Z         PASS [   0.096s] ( 243/2579) spt::bin/spt cli::tests::multi_subnet_refuses_without_flag_then_resolves_with_it
2026-08-18T01:30:55.9912678Z         PASS [   0.153s] ( 244/2579) spt::bin/spt cli::tests::no_redeem_surface_claims_a_reverse_the_minting_side_could_not_open
2026-08-18T01:30:55.9913499Z         PASS [   0.150s] ( 245/2579) spt::bin/spt cli::tests::node_group_discards_self_and_skips_empty
2026-08-18T01:30:56.0071749Z         PASS [   0.143s] ( 246/2579) spt::bin/spt cli::tests::node_group_freshest_epoch_wins_and_unions_subnets
2026-08-18T01:30:56.0089355Z         PASS [   0.138s] ( 247/2579) spt::bin/spt cli::tests::node_grouped_render_structure_and_palette
2026-08-18T01:30:56.0100383Z         PASS [   0.125s] ( 248/2579) spt::bin/spt cli::tests::node_level_label_names_an_endpointless_peer
2026-08-18T01:30:56.0101400Z         PASS [   0.119s] ( 249/2579) spt::bin/spt cli::tests::node_rows_disambiguate_only_on_label_collision
2026-08-18T01:30:56.0103192Z         PASS [   0.139s] ( 250/2579) spt::bin/spt cli::tests::node_group_same_id_two_nodes_two_groups
2026-08-18T01:30:56.0582357Z         PASS [   0.157s] ( 251/2579) spt::bin/spt cli::tests::node_status_rows_denominator_counts_routable_only
2026-08-18T01:30:56.0877555Z         PASS [   2.302s] ( 252/2579) spt::bin/spt cli::tests::an_engine_room_reset_wipes_records_but_never_deletes_the_engine_room
2026-08-18T01:30:56.0924977Z         PASS [   0.188s] ( 253/2579) spt::bin/spt cli::tests::node_status_rows_settle_cheap_signals_probe_only_stale
2026-08-18T01:30:56.0978741Z         PASS [   0.193s] ( 254/2579) spt::bin/spt cli::tests::not_elevated_refuses_without_leaking_code_or_saving
2026-08-18T01:30:56.1663126Z         PASS [   0.192s] ( 255/2579) spt::bin/spt cli::tests::notify_subnet_resolution_home_default
2026-08-18T01:30:56.2034704Z         PASS [   0.198s] ( 256/2579) spt::bin/spt cli::tests::only_a_bake_that_can_admit_the_whole_node_demands_the_acknowledgment
2026-08-18T01:30:56.2141478Z         PASS [   0.226s] ( 257/2579) spt::bin/spt cli::tests::notify_surface_parses
2026-08-18T01:30:56.2142101Z         PASS [   0.203s] ( 258/2579) spt::bin/spt cli::tests::only_rows_with_a_node_are_asked_and_answers_land_on_their_own_row
2026-08-18T01:30:56.2318427Z         PASS [   0.215s] ( 259/2579) spt::bin/spt cli::tests::only_the_send_side_defaults_to_msg
2026-08-18T01:30:56.2319749Z         PASS [   0.221s] ( 260/2579) spt::bin/spt cli::tests::origin_asset_urls_latest_and_tag
2026-08-18T01:30:56.2424879Z         PASS [   0.232s] ( 261/2579) spt::bin/spt cli::tests::own_nested_section_renders_under_this_node_without_moving_the_total
2026-08-18T01:30:56.2456736Z         PASS [   0.161s] ( 262/2579) spt::bin/spt cli::tests::pair_namespace_is_gone
2026-08-18T01:30:56.2975266Z         PASS [   0.199s] ( 263/2579) spt::bin/spt cli::tests::peer_health_line_names_the_stage_and_stays_silent_when_idle
2026-08-18T01:30:56.3029131Z         PASS [   0.210s] ( 264/2579) spt::bin/spt cli::tests::peer_health_line_names_absent_peers_as_their_own_state
2026-08-18T01:30:56.3806952Z         PASS [   0.208s] ( 265/2579) spt::bin/spt cli::tests::poll_until_ready_fastpath_timeout_and_later_success
2026-08-18T01:30:56.3967727Z         PASS [   0.194s] ( 266/2579) spt::bin/spt cli::tests::post_step_notice_arbitration
2026-08-18T01:30:56.4686121Z         PASS [   0.236s] ( 267/2579) spt::bin/spt cli::tests::project_index_line_states_health_not_presence
2026-08-18T01:30:56.4719426Z         PASS [   0.260s] ( 268/2579) spt::bin/spt cli::tests::probe_all_cap_batches_into_windows
2026-08-18T01:30:56.5252321Z         PASS [   0.283s] ( 269/2579) spt::bin/spt cli::tests::prune_candidates_resolve_never_guess
2026-08-18T01:30:56.5803459Z         PASS [   0.679s] ( 270/2579) spt::bin/spt api::startup::tests::bind_assigns_home_and_revive_preserves_it
2026-08-18T01:30:56.5989063Z         PASS [   0.353s] ( 271/2579) spt::bin/spt cli::tests::psyche_companion_is_named_without_a_status
2026-08-18T01:30:56.6476609Z         PASS [   0.406s] ( 272/2579) spt::bin/spt cli::tests::probe_all_timeout_settles_false_without_stalling_batch
2026-08-18T01:30:56.6615734Z         PASS [   0.450s] ( 273/2579) spt::bin/spt cli::tests::probe_all_runs_concurrently_in_input_order
2026-08-18T01:30:56.7597516Z         PASS [   0.463s] ( 274/2579) spt::bin/spt cli::tests::public_help_carries_no_internal_codes_at_any_ruled_site
2026-08-18T01:30:56.9544699Z         PASS [   0.581s] ( 275/2579) spt::bin/spt cli::tests::purge_offline_gate_and_self_guard
2026-08-18T01:30:57.3059789Z         PASS [   0.780s] ( 276/2579) spt::bin/spt cli::tests::remote_cell_project_ref_from_gossiped_recent_projects
2026-08-18T01:30:57.3129534Z         PASS [   0.644s] ( 277/2579) spt::bin/spt cli::tests::resolve_transport_auto_follows_probe
2026-08-18T01:30:57.3631692Z         PASS [   0.889s] ( 278/2579) spt::bin/spt cli::tests::registered_github_home_detects_active_collision
2026-08-18T01:30:57.3644006Z         PASS [   0.405s] ( 279/2579) spt::bin/spt cli::tests::rest_filter_hides_suspended_shows_all_and_corrupt_always
2026-08-18T01:30:57.4711694Z         PASS [   0.795s] ( 280/2579) spt::bin/spt cli::tests::resolve_proof_target_override_reads_on_disk
2026-08-18T01:30:57.4712760Z         PASS [   0.831s] ( 281/2579) spt::bin/spt cli::tests::requesting_verbs_force_an_explicit_directionality
2026-08-18T01:30:57.4713487Z         PASS [   0.154s] ( 282/2579) spt::bin/spt cli::tests::rest_filter_status_first_ordering
2026-08-18T01:30:57.4725993Z         PASS [   0.102s] ( 283/2579) spt::bin/spt cli::tests::restart_plans_lethal_leg_last
2026-08-18T01:30:57.4726716Z         PASS [   0.889s] ( 284/2579) spt::bin/spt api::startup::tests::bind_gateway_earns_no_online_stamp
2026-08-18T01:30:57.4760196Z         PASS [   0.716s] ( 285/2579) spt::bin/spt cli::tests::resolve_transport_explicit_never_probes
2026-08-18T01:30:57.4781241Z         PASS [   0.171s] ( 286/2579) spt::bin/spt cli::tests::rest_filter_total_disclosure_and_corrupt_annotation
2026-08-18T01:30:57.5073999Z         PASS [   0.135s] ( 287/2579) spt::bin/spt cli::tests::ring_no_reply_arms_report_the_wait_in_the_callers_unit
2026-08-18T01:30:57.5599642Z         PASS [   0.133s] ( 288/2579) spt::bin/spt cli::tests::ring_timeout_defaults
2026-08-18T01:30:57.5600584Z         PASS [   0.129s] ( 289/2579) spt::bin/spt cli::tests::ring_timeout_parses_bare_as_minutes_and_honors_suffixes
2026-08-18T01:30:57.5878451Z         PASS [   0.127s] ( 290/2579) spt::bin/spt cli::tests::self_endpoint_line_reports_the_live_relay_or_says_there_is_none
2026-08-18T01:30:57.6208836Z         PASS [   0.131s] ( 291/2579) spt::bin/spt cli::tests::self_pin_annotates_psyche_host_failure
2026-08-18T01:30:57.6209681Z         PASS [   0.154s] ( 292/2579) spt::bin/spt cli::tests::run_bounded_yields_value_or_timeout_default
2026-08-18T01:30:57.6245237Z         PASS [   0.065s] ( 293/2579) spt::bin/spt cli::tests::self_pin_includes_description_when_present
2026-08-18T01:30:57.6349850Z         PASS [   0.159s] ( 294/2579) spt::bin/spt cli::tests::self_pin_annotates_host_error
2026-08-18T01:30:57.6421381Z         PASS [   0.146s] ( 295/2579) spt::bin/spt cli::tests::self_pin_annotates_translation_fault
2026-08-18T01:30:57.7004991Z         PASS [   0.122s] ( 296/2579) spt::bin/spt cli::tests::send_reply_to_flag_is_removed_and_target_required
2026-08-18T01:30:57.7090658Z         PASS [   0.123s] ( 297/2579) spt::bin/spt cli::tests::send_user_msg_flag_parses
2026-08-18T01:30:57.9985762Z         PASS [   0.377s] ( 298/2579) spt::bin/spt cli::tests::shell_owner_exclusivity_negatives
2026-08-18T01:30:58.0995359Z         PASS [   0.350s] ( 299/2579) spt::bin/spt cli::tests::shell_spawn_profiled_option_resolves_and_shares_cap
2026-08-18T01:30:58.1026080Z         PASS [   1.630s] ( 300/2579) spt::bin/spt cli::tests::release_archive_extracts_to_a_registrable_root
2026-08-18T01:30:58.1993163Z         PASS [   0.534s] ( 301/2579) spt::bin/spt cli::tests::shell_relink_relaunches_offline_instances_only
2026-08-18T01:30:58.1993728Z         PASS [   0.193s] ( 302/2579) spt::bin/spt cli::tests::shell_subcommands_parse
2026-08-18T01:30:58.1997162Z         PASS [   0.140s] ( 303/2579) spt::bin/spt cli::tests::show_code_prints_reprovisioning_material
2026-08-18T01:30:58.3557823Z         PASS [   0.643s] ( 304/2579) spt::bin/spt cli::tests::shell_spawn_approval_floor_gates
2026-08-18T01:30:58.3558482Z         PASS [   0.683s] ( 305/2579) spt::bin/spt cli::tests::shell_channels_relay_sensory_and_text_file
2026-08-18T01:30:58.5029518Z         PASS [   0.304s] ( 306/2579) spt::bin/spt cli::tests::single_subnet_auto_selects_and_code_matches_seed
2026-08-18T01:30:58.5865625Z         PASS [   0.378s] ( 307/2579) spt::bin/spt cli::tests::shutdown_on_a_harness_hosted_endpoint_claims_no_process
2026-08-18T01:30:58.5871637Z         PASS [   1.100s] ( 308/2579) spt::bin/spt api::startup::tests::bind_listen_control_detach_keeps_the_earned_hosting_authority
2026-08-18T01:30:58.7019076Z         PASS [   0.542s] ( 309/2579) spt::bin/spt cli::tests::shutdown_on_a_broker_hosted_endpoint_stamps_after_the_reap
2026-08-18T01:30:58.7019897Z         PASS [   1.060s] ( 310/2579) spt::bin/spt cli::tests::shell_spawn_cap_and_over_cap_gates
2026-08-18T01:30:58.7264250Z         PASS [   0.442s] ( 311/2579) spt::bin/spt cli::tests::spt_hosted_no_relay_detection
2026-08-18T01:30:58.7268743Z         PASS [   0.625s] ( 312/2579) spt::bin/spt cli::tests::shutdown_and_stop_share_the_postcondition_and_differ_only_in_ceremony
2026-08-18T01:30:58.7985217Z         PASS [   0.475s] ( 313/2579) spt::bin/spt cli::tests::stage_then_swap_failed_fetch_preserves_install
2026-08-18T01:30:58.8272458Z         PASS [   0.121s] ( 314/2579) spt::bin/spt cli::tests::stall_evict_line_surfaces_only_a_real_tally
2026-08-18T01:30:58.8273325Z         PASS [   0.121s] ( 315/2579) spt::bin/spt cli::tests::stop_guard_refuses_live_sessions_without_force
2026-08-18T01:30:58.8294913Z         PASS [   0.257s] ( 316/2579) spt::bin/spt api::startup::tests::bind_live_agent_over_prior_ready_agent_earns_online_on_controllable_with_preserved_type
2026-08-18T01:30:58.8338129Z         PASS [   0.096s] ( 317/2579) spt::bin/spt cli::tests::subnet_arg_shapes_parse
2026-08-18T01:30:58.8644687Z         PASS [   0.129s] ( 318/2579) spt::bin/spt cli::tests::subcommands_parse
2026-08-18T01:30:58.9372473Z         PASS [   0.161s] ( 319/2579) spt::bin/spt cli::tests::subnet_mode_lines_state_declared_captured_and_pending
2026-08-18T01:30:58.9434511Z         PASS [   0.093s] ( 320/2579) spt::bin/spt cli::tests::the_bare_form_is_the_send_form
2026-08-18T01:30:58.9477680Z         PASS [   0.122s] ( 321/2579) spt::bin/spt cli::tests::subprocess_detail_prefers_stderr_then_stdout
2026-08-18T01:30:58.9478394Z         PASS [   0.125s] ( 322/2579) spt::bin/spt cli::tests::subnet_status_renders_rows_and_hints_never_secrets
2026-08-18T01:30:58.9631530Z         PASS [   0.132s] ( 323/2579) spt::bin/spt cli::tests::subnets_joined_banner_renders_rows_and_divider
2026-08-18T01:30:58.9813730Z         PASS [   0.040s] ( 324/2579) spt::bin/spt cli::tests::the_bare_form_refuses_rather_than_guessing
2026-08-18T01:30:59.0575290Z         PASS [   5.555s] ( 325/2579) spt::bin/spt cli::tests::adapter_translate_proof_gates_on_commit
2026-08-18T01:30:59.0582352Z         PASS [   0.540s] ( 326/2579) spt::bin/spt cli::tests::staged_floor_admits_when_core_meets_floor
2026-08-18T01:30:59.0715402Z         PASS [   0.128s] ( 327/2579) spt::bin/spt cli::tests::the_bare_node_verb_defaults_to_the_status_view_under_both_spellings
2026-08-18T01:30:59.0744333Z         PASS [   0.128s] ( 328/2579) spt::bin/spt cli::tests::the_bare_status_view_states_the_mode_facts_for_every_row
2026-08-18T01:30:59.0746867Z         PASS [   0.119s] ( 329/2579) spt::bin/spt cli::tests::the_conjunction_notice_fires_per_missing_half_and_stays_silent_when_both_hold
2026-08-18T01:30:59.0962163Z         PASS [   0.120s] ( 330/2579) spt::bin/spt cli::tests::the_conjunction_notice_names_the_whitelist_its_seat_and_the_posture
2026-08-18T01:30:59.0963066Z         PASS [   0.148s] ( 331/2579) spt::bin/spt cli::tests::the_briefing_prescribes_only_verbs_the_grammar_has
2026-08-18T01:30:59.1039817Z         PASS [   0.061s] ( 332/2579) spt::bin/spt cli::tests::the_create_ceremony_names_the_heal_for_an_older_minter
2026-08-18T01:30:59.1098796Z         PASS [   0.067s] ( 333/2579) spt::bin/spt cli::tests::the_cross_node_mutual_refusal_is_gone_from_every_surface_that_carried_it
2026-08-18T01:30:59.1164475Z         PASS [   0.041s] ( 334/2579) spt::bin/spt cli::tests::the_denial_names_the_blast_radius_and_a_cure_that_fits_its_ground
2026-08-18T01:30:59.1515390Z         PASS [   0.054s] ( 335/2579) spt::bin/spt cli::tests::the_engine_room_briefing_speaks_the_cli_vocabulary
2026-08-18T01:30:59.1548575Z         PASS [   0.045s] ( 336/2579) spt::bin/spt cli::tests::the_fork_pair_consequence_follows_the_chain_verdict_not_the_rule_rows
2026-08-18T01:30:59.1549709Z         PASS [   0.078s] ( 337/2579) spt::bin/spt cli::tests::the_deprecation_note_renders_on_both_spellings_of_the_node_verb
2026-08-18T01:30:59.1989990Z         PASS [   0.103s] ( 338/2579) spt::bin/spt cli::tests::the_flagless_access_listing_is_wired_distinctly_from_its_subcommands
2026-08-18T01:30:59.2063620Z         PASS [   0.641s] ( 339/2579) spt::bin/spt cli::tests::staged_floor_refuses_above_floor_and_leaves_dest_untouched
2026-08-18T01:30:59.2064458Z         PASS [   0.057s] ( 340/2579) spt::bin/spt cli::tests::the_legacy_allow_echo_says_discover_is_untouched_and_scopes_both_levers
2026-08-18T01:30:59.2971090Z         PASS [   0.128s] ( 341/2579) spt::bin/spt cli::tests::the_human_and_json_legs_agree_on_every_unlisted_row
2026-08-18T01:30:59.2972871Z         PASS [   0.113s] ( 342/2579) spt::bin/spt cli::tests::the_knock_prescription_names_the_fork_pair_only_where_it_is_needed
2026-08-18T01:30:59.3009984Z         PASS [   0.149s] ( 343/2579) spt::bin/spt cli::tests::the_gc_render_says_what_it_refused_and_what_it_would_delete
2026-08-18T01:30:59.3018606Z         PASS [   0.191s] ( 344/2579) spt::bin/spt cli::tests::the_evidence_census_reads_each_local_source
2026-08-18T01:30:59.3609714Z         PASS [   0.138s] ( 345/2579) spt::bin/spt cli::tests::the_mint_probe_answers_only_for_a_fresh_mint
2026-08-18T01:30:59.3680507Z         PASS [   0.539s] ( 346/2579) spt::bin/spt api::startup::tests::bind_records_cwd_so_picker_can_group_by_project
2026-08-18T01:30:59.4096132Z         PASS [   0.199s] ( 347/2579) spt::bin/spt cli::tests::the_presenters_three_renderings_stay_three_things
2026-08-18T01:30:59.4098454Z         PASS [   0.168s] ( 348/2579) spt::bin/spt cli::tests::the_rendered_peer_fraction_counts_one_population_across_a_subnet_leave
2026-08-18T01:30:59.4804461Z         PASS [   0.186s] ( 349/2579) spt::bin/spt cli::tests::the_remote_knock_refusals_render_as_prose
2026-08-18T01:30:59.4809504Z         PASS [   0.173s] ( 350/2579) spt::bin/spt cli::tests::the_rendered_section_is_the_composers_output
2026-08-18T01:30:59.5211060Z         PASS [   0.369s] ( 351/2579) spt::bin/spt cli::tests::the_local_and_wire_arms_write_one_identical_grant
2026-08-18T01:30:59.5211768Z         PASS [   0.159s] ( 352/2579) spt::bin/spt api::startup::tests::bind_refuses_a_session_id_that_squats_a_psyche_custody_sid
2026-08-18T01:30:59.6083449Z         PASS [   0.261s] ( 353/2579) spt::bin/spt cli::tests::the_seat_and_the_acknowledgment_are_the_mints_and_both_arms_refuse_alike
2026-08-18T01:30:59.6085546Z         PASS [   0.145s] ( 354/2579) spt::bin/spt cli::tests::the_three_landings_render_distinct_lines
2026-08-18T01:30:59.6288598Z         PASS [   0.138s] ( 355/2579) spt::bin/spt cli::tests::the_unlisted_listing_drops_an_excluded_peer_and_keeps_the_rest
2026-08-18T01:30:59.6289373Z         PASS [   0.151s] ( 356/2579) spt::bin/spt cli::tests::the_tuple_flags_build_the_rule_they_name
2026-08-18T01:30:59.6290029Z         PASS [   0.071s] ( 357/2579) spt::bin/spt cli::tests::the_unspooled_remedy_prescribes_a_verb_the_grammar_has
2026-08-18T01:30:59.6290838Z         PASS [   0.213s] ( 358/2579) spt::bin/spt cli::tests::the_three_send_outcomes_owe_three_different_receipts
2026-08-18T01:30:59.6494694Z         PASS [   0.069s] ( 359/2579) spt::bin/spt cli::tests::trust_mutation_gate_refuses_without_confirmed_elevation
2026-08-18T01:30:59.6495432Z         PASS [   0.056s] ( 360/2579) spt::bin/spt cli::tests::trust_warning_verbs_parse
2026-08-18T01:30:59.6496162Z         PASS [   0.078s] ( 361/2579) spt::bin/spt cli::tests::this_node_group_merges_roster_with_unbound_truth
2026-08-18T01:30:59.6565179Z         PASS [   0.114s] ( 362/2579) spt::bin/spt cli::tests::the_visible_alias_reaches_the_root_listing
2026-08-18T01:30:59.6574898Z         PASS [   0.320s] ( 363/2579) spt::bin/spt cli::tests::the_surface_section_rides_the_ruled_sites_and_no_others
2026-08-18T01:30:59.6575523Z         PASS [   0.036s] ( 364/2579) spt::bin/spt cli::tests::unknown_elevation_falls_back
2026-08-18T01:30:59.6884018Z         PASS [   0.138s] ( 365/2579) spt::bin/spt cli::tests::the_widening_remedy_is_sited_with_its_flag_not_in_the_shared_section
2026-08-18T01:30:59.7186649Z         PASS [   0.072s] ( 366/2579) spt::bin/spt cli::tests::unknown_named_subnet_is_usage_error
2026-08-18T01:30:59.7346004Z         PASS [   0.081s] ( 367/2579) spt::bin/spt cli::tests::update_adapters_verb_parses_with_optional_names
2026-08-18T01:30:59.7346785Z         PASS [   0.078s] ( 368/2579) spt::bin/spt cli::tests::what_the_listing_prescribes_is_what_the_approve_path_honors
2026-08-18T01:30:59.7347678Z         PASS [   0.085s] ( 369/2579) spt::bin/spt cli::tests::update_fetch_apply_flag_parses
2026-08-18T01:31:00.4883332Z         PASS [   0.816s] ( 370/2579) spt::bin/spt cli::tests::whoami_parses_as_the_identity_verb
2026-08-18T01:31:00.5909742Z         PASS [   4.206s] ( 371/2579) spt::bin/spt cli::tests::purge_force_asks_before_it_tears_anything_down
2026-08-18T01:31:00.5911701Z         PASS [   0.806s] ( 372/2579) spt::bin/spt elevation::tests::already_elevated_short_circuits_on_every_os
2026-08-18T01:31:00.5916157Z         PASS [   0.858s] ( 373/2579) spt::bin/spt cli::verb_surface_route_table::the_exclusions_are_real_refusals
2026-08-18T01:31:00.5947512Z         PASS [   0.896s] ( 374/2579) spt::bin/spt cli::verb_surface_route_table::every_bringup_door_routes_where_it_says
2026-08-18T01:31:00.6157876Z         PASS [   1.093s] ( 375/2579) spt::bin/spt api::startup::tests::bind_with_type_establishes_a_gateway_endpoint
2026-08-18T01:31:00.6181614Z         PASS [   0.144s] ( 376/2579) spt::bin/spt elevation::tests::launcher_argv_is_absolute_exe_plus_verbatim_args
2026-08-18T01:31:00.6390117Z         PASS [   0.905s] ( 377/2579) spt::bin/spt elevation::tests::fallback_message_names_authenticator_app_and_subnet
2026-08-18T01:31:00.6601036Z         PASS [   0.152s] ( 378/2579) spt::bin/spt elevation::tests::launchers_never_shell_interpolate_a_crafted_arg
2026-08-18T01:31:00.6745471Z         PASS [   0.942s] ( 379/2579) spt::bin/spt elevation::tests::current_returns_a_determinate_level_on_supported_platforms
2026-08-18T01:31:00.6797833Z         PASS [   0.152s] ( 380/2579) spt::bin/spt elevation::tests::print_hint_floor_uses_absolute_path_each_os
2026-08-18T01:31:00.6863876Z         PASS [   0.141s] ( 381/2579) spt::bin/spt elevation::tests::unix_path_order_tty_then_pkexec_then_terminal_then_hint
2026-08-18T01:31:00.6886860Z         PASS [   0.952s] ( 382/2579) spt::bin/spt elevation::tests::gate_shows_only_when_confirmed_elevated
2026-08-18T01:31:00.6888030Z         PASS [   0.135s] ( 383/2579) spt::bin/spt elevation::tests::windows_uac_only_interactive_other_always_prints
2026-08-18T01:31:00.6919612Z         PASS [   0.053s] ( 384/2579) spt::bin/spt helpfmt::tests::bold_styles_with_color_and_strips_without
2026-08-18T01:31:00.6922321Z         PASS [   0.074s] ( 385/2579) spt::bin/spt helpfmt::tests::atx_header_at_line_start_strips_and_bolds
2026-08-18T01:31:00.7538922Z         PASS [   0.119s] ( 386/2579) spt::bin/spt api::startup::tests::bind_with_unrelated_sid_is_unaffected_by_the_squat_guard
2026-08-18T01:31:00.7539887Z         PASS [   0.082s] ( 387/2579) spt::bin/spt helpfmt::tests::color_enabled_truth_table
2026-08-18T01:31:00.7541066Z         PASS [   0.092s] ( 388/2579) spt::bin/spt helpfmt::tests::code_styles_with_color_and_strips_without
2026-08-18T01:31:00.7708671Z         PASS [   0.085s] ( 389/2579) spt::bin/spt helpfmt::tests::dual_contract_token_unstyled_while_prose_styles_on_color
2026-08-18T01:31:00.7716561Z         PASS [   0.094s] ( 390/2579) spt::bin/spt helpfmt::tests::dual_contract_token_survives_strip_mode
2026-08-18T01:31:00.8796011Z         PASS [   0.125s] ( 391/2579) spt::bin/spt helpfmt::tests::marker_spans_a_clap_soft_wrap
2026-08-18T01:31:00.8799768Z         PASS [   0.135s] ( 392/2579) spt::bin/spt helpfmt::tests::link_becomes_its_text
2026-08-18T01:31:00.8800432Z         PASS [   0.093s] ( 393/2579) spt::bin/spt helpfmt::tests::multibyte_text_survives
2026-08-18T01:31:00.8801212Z         PASS [   0.161s] ( 394/2579) spt::bin/spt helpfmt::tests::marker_never_spans_a_hard_break
2026-08-18T01:31:00.8802117Z         PASS [   0.186s] ( 395/2579) spt::bin/spt helpfmt::tests::empty_and_unmatched_markers_stay_literal
2026-08-18T01:31:00.9396972Z         PASS [   0.151s] ( 396/2579) spt::bin/spt helpfmt::tests::nested_code_inside_bold_styles_both
2026-08-18T01:31:00.9397690Z         PASS [   0.098s] ( 397/2579) spt::bin/spt helpfmt::tests::resolve_console_color_strips_when_vt_unavailable
2026-08-18T01:31:00.9399494Z         PASS [   0.146s] ( 398/2579) spt::bin/spt helpfmt::tests::plain_text_is_unchanged
2026-08-18T01:31:00.9400079Z         PASS [   0.094s] ( 399/2579) spt::bin/spt monicverb::tests::add_refuses_to_replace_and_update_refuses_to_invent
2026-08-18T01:31:00.9401646Z         PASS [   0.159s] ( 400/2579) spt::bin/spt helpfmt::tests::preexisting_ansi_is_passed_through_untouched
2026-08-18T01:31:00.9773437Z         PASS [   0.238s] ( 401/2579) spt::bin/spt api::startup::tests::empty_session_seed_refusal_spends_the_seed_no_restore
2026-08-18T01:31:01.0634543Z         PASS [   0.193s] ( 402/2579) spt::bin/spt picker::data::tests::disambiguate_project_ids_cases
2026-08-18T01:31:01.0883202Z         PASS [   0.238s] ( 403/2579) spt::bin/spt monicverb::tests::no_monic_verb_is_elevation_gated
2026-08-18T01:31:01.2591302Z         PASS [   0.332s] ( 404/2579) spt::bin/spt picker::data::tests::driven_by_display_renders_name_not_hex
2026-08-18T01:31:01.2592095Z         PASS [   0.332s] ( 405/2579) spt::bin/spt picker::data::tests::gather_endpoints_projects_from_seeded_index_with_zero_git
2026-08-18T01:31:01.2598874Z         PASS [   0.309s] ( 406/2579) spt::bin/spt picker::data::tests::non_drivable_predicate_covers_worker_and_psyche
2026-08-18T01:31:01.2621346Z         PASS [   0.292s] ( 407/2579) spt::bin/spt api::startup::tests::empty_session_seed_refused
2026-08-18T01:31:01.3041312Z         PASS [   0.372s] ( 408/2579) spt::bin/spt picker::data::tests::indexed_projection_full_w2shaped_and_absent_legs
2026-08-18T01:31:01.3812559Z         PASS [   0.333s] ( 409/2579) spt::bin/spt picker::data::tests::own_node_tab_label_falls_back_to_keyprefix
2026-08-18T01:31:01.4035932Z         PASS [   0.308s] ( 410/2579) spt::bin/spt picker::data::tests::picker_excludes_flat_worker_and_psyche
2026-08-18T01:31:01.4121782Z         PASS [   0.477s] ( 411/2579) spt::bin/spt picker::data::tests::gather_renders_live_unbound
2026-08-18T01:31:01.4419645Z         PASS [   0.213s] ( 412/2579) spt::bin/spt picker::data::tests::project_refs_from_sessions_excludes_owlery_and_dedups_newest_first
2026-08-18T01:31:01.5445964Z         PASS [   0.296s] ( 413/2579) spt::bin/spt picker::data::tests::project_refs_from_unions_fresh_origin_and_store_branches
2026-08-18T01:31:01.6676366Z         PASS [   0.384s] ( 414/2579) spt::bin/spt picker::data::tests::reconcile_overrides_subnet_with_local_roster
2026-08-18T01:31:01.6682371Z         PASS [   0.359s] ( 415/2579) spt::bin/spt picker::data::tests::remote_picker_renders_suspended_dead_perch_offline
2026-08-18T01:31:01.6683329Z         PASS [   0.267s] ( 416/2579) spt::bin/spt picker::data::tests::resume_rows_derive_per_row_project_and_drop_owlery_sessions
2026-08-18T01:31:01.7065017Z         PASS [   0.443s] ( 417/2579) spt::bin/spt api::startup::tests::establish_stamps_controllable_by_hosting_mode
2026-08-18T01:31:01.7398713Z         PASS [   0.302s] ( 418/2579) spt::bin/spt picker::data::tests::row_status_drives_unbound_display
2026-08-18T01:31:01.7399431Z         PASS [   0.102s] ( 419/2579) spt::bin/spt picker::model::tests::adapter_tree_nests_profiles
2026-08-18T01:31:01.8224215Z         PASS [   0.104s] ( 420/2579) spt::bin/spt api::startup::tests::fresh_bind_over_dead_life_needs_both_terminal_and_a_new_session
2026-08-18T01:31:01.8673036Z         PASS [   0.213s] ( 421/2579) spt::bin/spt picker::model::tests::back_unwinds
2026-08-18T01:31:01.9733981Z         PASS [   0.155s] ( 422/2579) spt::bin/spt picker::model::tests::category_labels_render_display_forms
2026-08-18T01:31:01.9735048Z         PASS [   0.520s] ( 423/2579) spt::bin/spt picker::data::tests::remote_rows_render_full_palette_parity
2026-08-18T01:31:01.9766992Z         PASS [   0.517s] ( 424/2579) spt::bin/spt picker::data::tests::resume_rows_title_from_index_cwd_map_with_pure_fallback
2026-08-18T01:31:01.9767877Z         PASS [   0.380s] ( 425/2579) spt::bin/spt picker::data::tests::shared_machine_is_one_group_with_unioned_subnets
2026-08-18T01:31:01.9783224Z         PASS [   0.268s] ( 426/2579) spt::bin/spt picker::model::tests::build_project_choices_head_here_rest
2026-08-18T01:31:02.0308165Z         PASS [   0.280s] ( 427/2579) spt::bin/spt picker::model::tests::category_ring_wraps
2026-08-18T01:31:02.0985092Z         PASS [   0.197s] ( 428/2579) spt::bin/spt picker::model::tests::confirm_local_offline_unchanged_by_wake_split
2026-08-18T01:31:02.0985921Z         PASS [   0.234s] ( 429/2579) spt::bin/spt picker::model::tests::change_adapter_picks_and_returns_to_confirm
2026-08-18T01:31:02.1321919Z         PASS [   0.208s] ( 430/2579) spt::bin/spt picker::model::tests::confirm_options_remote_suspended_is_wake_not_start
2026-08-18T01:31:02.1325927Z         PASS [   0.242s] ( 431/2579) spt::bin/spt picker::model::tests::choose_project_outcome_bakes_cwd_and_diverts
2026-08-18T01:31:02.1491924Z         PASS [   0.237s] ( 432/2579) spt::bin/spt picker::model::tests::confirm_options_status_dependent
2026-08-18T01:31:02.2724320Z         PASS [   0.460s] ( 433/2579) spt::bin/spt api::startup::tests::fresh_create_over_a_stopped_life_reads_active_with_no_wake
2026-08-18T01:31:02.3376926Z         PASS [   0.286s] ( 434/2579) spt::bin/spt picker::model::tests::confirm_terminal_wake_carries_raw_node
2026-08-18T01:31:02.3416325Z         PASS [   0.220s] ( 435/2579) spt::bin/spt picker::model::tests::create_outcome_bakes_run
2026-08-18T01:31:02.3907574Z         PASS [   0.257s] ( 436/2579) spt::bin/spt picker::model::tests::cursor_clamps
2026-08-18T01:31:02.4048081Z         PASS [   0.308s] ( 437/2579) spt::bin/spt picker::model::tests::create_new_multisubnet_inserts_home_layer
2026-08-18T01:31:02.4082420Z         PASS [   0.478s] ( 438/2579) spt::bin/spt picker::model::tests::confirm_terminal_routes
2026-08-18T01:31:02.4362966Z         PASS [   0.285s] ( 439/2579) spt::bin/spt picker::model::tests::display_status_four_state_type_gated
2026-08-18T01:31:02.5341287Z         PASS [   0.211s] ( 440/2579) spt::bin/spt picker::model::tests::empty_scope_opens_create
2026-08-18T01:31:02.5691079Z         PASS [   0.443s] ( 441/2579) spt::bin/spt picker::model::tests::display_mapping_matrix
2026-08-18T01:31:02.5693229Z         PASS [   0.275s] ( 442/2579) spt::bin/spt picker::model::tests::display_status_unbound_is_hollow_and_attachable
2026-08-18T01:31:02.5793941Z         PASS [   0.306s] ( 443/2579) spt::bin/spt api::startup::tests::fresh_create_with_no_prior_carries_no_rest_state
2026-08-18T01:31:02.6419051Z         PASS [   0.204s] ( 444/2579) spt::bin/spt picker::model::tests::from_resource_row_maps_gossiped_adapter_projects_controlled
2026-08-18T01:31:02.6628148Z         PASS [   0.257s] ( 445/2579) spt::bin/spt picker::model::tests::esc_backs_out_of_home_layer
2026-08-18T01:31:02.6950623Z         PASS [   0.152s] ( 446/2579) spt::bin/spt picker::model::tests::home_selection_bakes_into_run_subnet
2026-08-18T01:31:02.6952000Z         PASS [   0.278s] ( 447/2579) spt::bin/spt picker::model::tests::filter_narrows
2026-08-18T01:31:02.7002249Z         PASS [   0.325s] ( 448/2579) spt::bin/spt picker::model::tests::ep_display_glyph_and_square_palette
2026-08-18T01:31:02.7028537Z         PASS [   0.133s] ( 449/2579) spt::bin/spt picker::model::tests::launch_keys_live_only_on_launch_capable_highlights
2026-08-18T01:31:02.7048935Z         PASS [   0.128s] ( 450/2579) spt::bin/spt api::startup::tests::listen_never_asserts_hosting_topology_and_bind_still_does
2026-08-18T01:31:02.7072570Z         PASS [   0.144s] ( 451/2579) spt::bin/spt picker::model::tests::kind_routes
2026-08-18T01:31:02.7811769Z         PASS [   0.133s] ( 452/2579) spt::bin/spt picker::model::tests::prefill_jumps_to_create
2026-08-18T01:31:02.7812917Z         PASS [   0.111s] ( 453/2579) spt::bin/spt picker::model::tests::project_filter_keys_on_slug_while_tab_renders_display
2026-08-18T01:31:02.7818040Z         PASS [   0.102s] ( 454/2579) spt::bin/spt picker::model::tests::purge_confirm_yields_outcome_and_backs_out
2026-08-18T01:31:02.7842445Z         PASS [   0.100s] ( 455/2579) spt::bin/spt picker::model::tests::purge_shortcut_gates_to_offline_local
2026-08-18T01:31:02.7977944Z         PASS [   1.876s] ( 456/2579) spt::bin/spt picker::data::tests::home_subnet_options_is_mru_ordered
2026-08-18T01:31:02.8985991Z         PASS [   0.184s] ( 457/2579) spt::bin/spt picker::model::tests::reenter_create_keeps_or_clears_id
2026-08-18T01:31:02.9078280Z         PASS [   0.188s] ( 458/2579) spt::bin/spt picker::model::tests::remove_endpoint_drops_row_and_clamps_cursor
2026-08-18T01:31:02.9453965Z         PASS [   0.240s] ( 459/2579) spt::bin/spt api::startup::tests::listen_online_gate_refuses_capability_only_online
2026-08-18T01:31:02.9454752Z         PASS [   0.240s] ( 460/2579) spt::bin/spt picker::model::tests::resume_outcome_adapter_follows_recorded_row
2026-08-18T01:31:03.0224720Z         PASS [   0.233s] ( 461/2579) spt::bin/spt picker::model::tests::resume_outcome_bakes_session
2026-08-18T01:31:03.0358894Z         PASS [   0.257s] ( 462/2579) spt::bin/spt picker::model::tests::resume_title_render
2026-08-18T01:31:03.0909943Z         PASS [   0.309s] ( 463/2579) spt::bin/spt picker::model::tests::should_offer_project_choice_fire_conditions
2026-08-18T01:31:03.1603667Z         PASS [   0.275s] ( 464/2579) spt::bin/spt picker::model::tests::the_picker_refuses_the_reserved_id_as_it_is_typed
2026-08-18T01:31:03.1608107Z         PASS [   0.378s] ( 465/2579) spt::bin/spt picker::model::tests::single_subnet_skips_home_layer
2026-08-18T01:31:03.1631000Z         PASS [   0.371s] ( 466/2579) spt::bin/spt picker::model::tests::suspended_is_distinct_from_offline
2026-08-18T01:31:03.2335877Z         PASS [   0.332s] ( 467/2579) spt::bin/spt picker::model::tests::visible_partitions_and_sorts
2026-08-18T01:31:03.2482209Z         PASS [   0.303s] ( 468/2579) spt::bin/spt api::startup::tests::listen_orphan_exit_line_names_self_and_parent
2026-08-18T01:31:03.2525209Z         PASS [   0.307s] ( 469/2579) spt::bin/spt picker::shortcut::tests::basename_is_parameterized
2026-08-18T01:31:03.2590084Z         PASS [   0.229s] ( 470/2579) spt::bin/spt picker::shortcut::tests::the_body_is_the_ladder_verb
2026-08-18T01:31:03.2657172Z         PASS [   0.260s] ( 471/2579) spt::bin/spt picker::shortcut::tests::sentinel_detection_spans_both_generations
2026-08-18T01:31:03.2743248Z         PASS [  10.098s] ( 472/2579) spt::bin/spt cli::tests::a_remote_fork_refuses_delete_source_whole_rather_than_trimming_it
2026-08-18T01:31:03.3539862Z         PASS [   0.235s] ( 473/2579) spt::bin/spt picker::shortcut::tests::write_create_update_regenerate_refuse
2026-08-18T01:31:03.3740446Z         PASS [   0.201s] ( 474/2579) spt::bin/spt picker::tests::backspace_backs_out_screens_like_esc
2026-08-18T01:31:03.3795602Z         PASS [   0.218s] ( 475/2579) spt::bin/spt picker::tests::backspace_stays_char_delete_in_text_contexts
2026-08-18T01:31:03.3818459Z         PASS [   0.218s] ( 476/2579) spt::bin/spt picker::tests::purge_outcomes_convert_to_flash_lines
2026-08-18T01:31:03.3819057Z         PASS [   0.129s] ( 477/2579) spt::bin/spt picker::view::tests::adapter_tree_buffer
2026-08-18T01:31:03.4071565Z         PASS [   0.178s] ( 478/2579) spt::bin/spt picker::tests::purge_transition_reconstructs_the_complete_screen_after_external_mutation
2026-08-18T01:31:03.4205733Z         PASS [   0.172s] ( 479/2579) spt::bin/spt api::startup::tests::live_perch_under_other_session_conflicts
2026-08-18T01:31:03.5590636Z         PASS [   0.254s] ( 480/2579) spt::bin/spt picker::view::tests::choose_project_buffer_keeps_confirm_panel
2026-08-18T01:31:03.5680800Z         PASS [   0.280s] ( 481/2579) spt::bin/spt picker::view::tests::change_adapter_screen_renders_tree_and_apply_legend
2026-08-18T01:31:03.5869882Z         PASS [   0.259s] ( 482/2579) spt::bin/spt picker::view::tests::confirm_fork_and_shortcut_labels_are_dir_relative
2026-08-18T01:31:03.5908892Z         PASS [   0.316s] ( 483/2579) spt::bin/spt picker::view::tests::confirm_buffer_options
2026-08-18T01:31:03.7527577Z         PASS [   0.300s] ( 484/2579) spt::bin/spt picker::view::tests::create_home_lists_subnets
2026-08-18T01:31:03.7546711Z         PASS [   0.330s] ( 485/2579) spt::bin/spt picker::view::tests::every_picker_list_view_keeps_its_caret_on_screen
2026-08-18T01:31:03.7547762Z         PASS [   0.355s] ( 486/2579) spt::bin/spt picker::view::tests::confirm_panel_history_renders_display_not_slug
2026-08-18T01:31:03.7558044Z         PASS [   0.362s] ( 487/2579) spt::bin/spt picker::view::tests::footer_hints_h_s_only_when_launch_keys_live
2026-08-18T01:31:03.7574122Z         PASS [   0.333s] ( 488/2579) spt::bin/spt api::startup::tests::missing_seed_refused
2026-08-18T01:31:03.7825725Z         PASS [   0.373s] ( 489/2579) spt::bin/spt picker::view::tests::kind_buffer
2026-08-18T01:31:03.8467792Z         PASS [   0.278s] ( 490/2579) spt::bin/spt picker::view::tests::pick_buffer_has_squares_and_description
2026-08-18T01:31:03.8468601Z         PASS [   0.279s] ( 491/2579) spt::bin/spt picker::view::tests::pick_empty_category_hint
2026-08-18T01:31:03.9088008Z         PASS [   0.316s] ( 492/2579) spt::bin/spt picker::view::tests::resume_buffer_keeps_confirm_panel
2026-08-18T01:31:03.9088828Z         PASS [   0.229s] ( 493/2579) spt::bin/spt picker::view::tests::resume_buffer_lists_sessions
2026-08-18T01:31:03.9331369Z         PASS [   0.219s] ( 494/2579) spt::bin/spt picker::view::tests::the_caret_row_accounts_for_the_group_headers_above_it
2026-08-18T01:31:04.0162989Z         PASS [   0.249s] ( 495/2579) spt::bin/spt picker::view::tests::the_caret_stays_on_screen_when_the_list_outruns_the_viewport
2026-08-18T01:31:04.0165397Z         PASS [   0.390s] ( 496/2579) spt::bin/spt picker::view::tests::pick_status_line_four_state
2026-08-18T01:31:04.0686488Z         PASS [   0.324s] ( 497/2579) spt::bin/spt rc::tests::a_bringable_target_reaches_bring_up_with_the_offline_row_present
2026-08-18T01:31:04.1494674Z         PASS [   0.373s] ( 498/2579) spt::bin/spt rc::tests::a_refusal_names_the_targets_own_entry_surface
2026-08-18T01:31:04.1721722Z         PASS [   0.417s] ( 499/2579) spt::bin/spt api::startup::tests::no_seed_is_the_fallback_trigger_then_sid_binds
2026-08-18T01:31:04.2577020Z         PASS [   0.452s] ( 500/2579) spt::bin/spt rc::tests::attach_against_stopped_daemon_never_spawns_and_exits_loud
2026-08-18T01:31:04.2633675Z         PASS [   0.445s] ( 501/2579) spt::bin/spt rc::tests::attach_gate_routes_on_session_truth_not_the_row
2026-08-18T01:31:04.3127235Z         PASS [   0.406s] ( 502/2579) spt::bin/spt rc::tests::attach_offline_endpoint_short_circuits_clean
2026-08-18T01:31:04.3615258Z         PASS [   0.447s] ( 503/2579) spt::bin/spt rc::tests::bracketed_paste_framing_is_exact_and_content_verbatim
2026-08-18T01:31:04.4042623Z         PASS [   0.471s] ( 504/2579) spt::bin/spt rc::tests::bringable_is_the_engine_room_addressed_plainly_with_a_code
2026-08-18T01:31:04.4059291Z         PASS [   9.822s] ( 505/2579) spt::bin/spt cli::tests::endpoint_role_overwrite_is_the_sole_writer
2026-08-18T01:31:04.4884682Z         PASS [   0.506s] ( 506/2579) spt::bin/spt rc::tests::bringup_prompt_names_the_node_and_the_home_subnet
2026-08-18T01:31:04.4885513Z         PASS [   0.506s] ( 507/2579) spt::bin/spt rc::tests::canonical_wire_id_strips_qualifiers_to_the_bare_id
2026-08-18T01:31:04.4888916Z         PASS [   0.342s] ( 508/2579) spt::bin/spt rc::tests::clipboard_paste_wraps_nonempty_and_noops_on_empty_or_failure
2026-08-18T01:31:04.4983960Z         PASS [   0.430s] ( 509/2579) spt::bin/spt rc::tests::classify_read_err_eof_is_graceful_not_fatal
2026-08-18T01:31:04.5905315Z         PASS [   0.411s] ( 510/2579) spt::bin/spt api::startup::tests::only_an_unverified_refusal_names_its_escape
2026-08-18T01:31:04.5906284Z         PASS [   0.323s] ( 511/2579) spt::bin/spt rc::tests::detach_prefix_spans_chunks
2026-08-18T01:31:04.5906798Z         PASS [   0.339s] ( 512/2579) spt::bin/spt rc::tests::detach_keybind_semantics
2026-08-18T01:31:04.5907428Z         PASS [   0.233s] ( 513/2579) spt::bin/spt rc::tests::driver_phrase_names_own_node_plainly_but_remote_verbatim
2026-08-18T01:31:04.5980822Z         PASS [   0.286s] ( 514/2579) spt::bin/spt rc::tests::display_guard_postlude_exactly_once_and_inactive_silent
2026-08-18T01:31:04.7037654Z         PASS [   0.296s] ( 515/2579) spt::bin/spt rc::tests::first_event_stall_decision
2026-08-18T01:31:04.7127874Z         PASS [   0.240s] ( 516/2579) spt::bin/spt rc::tests::fold_code_key_prompt_rules
2026-08-18T01:31:04.7142492Z         PASS [   0.232s] ( 517/2579) spt::bin/spt rc::tests::give_up_copy_names_daemon_down_vs_generic
2026-08-18T01:31:04.7202536Z         PASS [   0.231s] ( 518/2579) spt::bin/spt rc::tests::harness_only_row_matches_online_seatless_live_agents_only
2026-08-18T01:31:04.8054459Z         PASS [   0.304s] ( 519/2579) spt::bin/spt rc::tests::identity_line_format
2026-08-18T01:31:04.8107598Z         PASS [   0.408s] ( 520/2579) spt::bin/spt rc::tests::establish_attach_reuses_the_probes_carried_pump_conn
2026-08-18T01:31:04.8512541Z         PASS [   0.256s] ( 521/2579) spt::bin/spt api::startup::tests::only_gone_changes_the_conflict_verdict
2026-08-18T01:31:04.8513216Z         PASS [   0.257s] ( 522/2579) spt::bin/spt rc::tests::key_event_step_detach_sm
2026-08-18T01:31:04.8660070Z         PASS [   0.270s] ( 523/2579) spt::bin/spt rc::tests::mouse_is_paste_only_right_button_down
2026-08-18T01:31:04.8864458Z         PASS [   0.282s] ( 524/2579) spt::bin/spt rc::tests::mouse_mode_decset_scan_survives_split_across_chunks
2026-08-18T01:31:04.8869912Z         PASS [   0.170s] ( 525/2579) spt::bin/spt rc::tests::op_minter_distinct_and_monotonic
2026-08-18T01:31:04.8953128Z         PASS [   0.182s] ( 526/2579) spt::bin/spt rc::tests::pre_broker_busy_guidance_fires_for_any_driver_not_just_remote
2026-08-18T01:31:04.9028598Z         PASS [   0.303s] ( 527/2579) spt::bin/spt rc::tests::mouse_mode_decset_scan_tracks_enable_and_sgr
2026-08-18T01:31:04.9128334Z         PASS [   0.198s] ( 528/2579) spt::bin/spt rc::tests::public_attach_failure_maps_deadline_class_only
2026-08-18T01:31:04.9142853Z         PASS [   0.194s] ( 529/2579) spt::bin/spt rc::tests::pump_status_emit_sequence_over_write_sink
2026-08-18T01:31:04.9937216Z         PASS [   0.164s] ( 530/2579) spt::bin/spt rc::tests::reassert_scanner_triggers_only_on_region_destroyers
2026-08-18T01:31:04.9938116Z         PASS [   0.189s] ( 531/2579) spt::bin/spt rc::tests::reassert_scanner_survives_split_across_chunks
2026-08-18T01:31:05.0175907Z         PASS [   0.157s] ( 532/2579) spt::bin/spt rc::tests::reconnect_banner_shows_the_countdown
2026-08-18T01:31:05.0181957Z         PASS [   0.174s] ( 533/2579) spt::bin/spt rc::tests::reconnect_banner_clears_and_centers
2026-08-18T01:31:05.0725986Z         PASS [   0.178s] ( 534/2579) spt::bin/spt rc::tests::scroll_dir_classifies_wheel_only
2026-08-18T01:31:05.0735261Z         PASS [   0.202s] ( 535/2579) spt::bin/spt rc::tests::reconnect_remaining_secs_counts_down_ceil
2026-08-18T01:31:05.0795017Z         PASS [   0.178s] ( 536/2579) spt::bin/spt rc::tests::scroll_sgr_emits_exact_xterm_bytes
2026-08-18T01:31:05.0805596Z         PASS [   0.209s] ( 537/2579) spt::bin/spt rc::tests::reconnect_window_expiry_decision
2026-08-18T01:31:05.0838318Z         PASS [   0.246s] ( 538/2579) spt::bin/spt api::startup::tests::parent_watchdog_triggers_exit_on_a_dead_parent_only
2026-08-18T01:31:05.1527524Z         PASS [   0.221s] ( 539/2579) spt::bin/spt rc::tests::status_assert_reserves_row1_then_repaints
2026-08-18T01:31:05.1528123Z         PASS [   0.226s] ( 540/2579) spt::bin/spt rc::tests::serve_eof_severed_vs_refused
2026-08-18T01:31:05.1567247Z         PASS [   0.182s] ( 541/2579) spt::bin/spt rc::tests::status_repaint_exact_bytes_and_right_align
2026-08-18T01:31:05.1638248Z         PASS [   0.172s] ( 542/2579) spt::bin/spt rc::tests::status_restore_exact_bytes
2026-08-18T01:31:05.1643743Z         PASS [   0.148s] ( 543/2579) spt::bin/spt rc::tests::status_row_marker_is_disabled_by_flag
2026-08-18T01:31:05.1679796Z         PASS [   0.150s] ( 544/2579) spt::bin/spt rc::tests::status_update_size_repoints_geometry
2026-08-18T01:31:05.2247915Z         PASS [   0.149s] ( 545/2579) spt::bin/spt rc::tests::the_client_refuses_engine_room_viewports_and_qualified_targets_only
2026-08-18T01:31:05.2285245Z         PASS [   0.155s] ( 546/2579) spt::bin/spt rc::tests::teardown_matrix_postlude_precedes_prose_across_every_final_class
2026-08-18T01:31:05.3063411Z         PASS [   0.196s] ( 547/2579) spt::bin/spt rc::tests::with_vt_output_disables_newline_auto_return
2026-08-18T01:31:05.3075215Z         PASS [   0.146s] ( 548/2579) spt::bin/spt rc::tests::with_vt_output_enables_virtual_terminal_processing
2026-08-18T01:31:05.3081500Z         PASS [   0.226s] ( 549/2579) spt::bin/spt rc::tests::translate_key_event_emits_exact_xterm_vt
2026-08-18T01:31:05.3971367Z         PASS [   0.213s] ( 550/2579) spt::bin/spt roster::tests::detect_self_by_ancestry_none_when_no_ancestor_owns_a_perch
2026-08-18T01:31:05.3972214Z         PASS [   0.190s] ( 551/2579) spt::bin/spt roster::tests::detect_self_id_endpoint_id_leg_is_label_only_and_perch_gated
2026-08-18T01:31:05.4016109Z         PASS [   0.211s] ( 552/2579) spt::bin/spt roster::tests::detect_self_by_ancestry_resolves_a_live_ancestor_perch
2026-08-18T01:31:05.4016980Z         PASS [   0.309s] ( 553/2579) spt::bin/spt api::startup::tests::post_spawn_bind_establishes_perch
2026-08-18T01:31:05.4385739Z         PASS [   0.266s] ( 554/2579) spt::bin/spt roster::tests::detect_self_resolves_spt_hosted_perch_via_parent_pid
2026-08-18T01:31:05.4667152Z         PASS [   0.281s] ( 555/2579) spt::bin/spt roster::tests::detect_self_id_resolves_identity_with_zero_git_spawns
2026-08-18T01:31:05.4891090Z         PASS [   0.207s] ( 556/2579) spt::bin/spt roster::tests::match_self_by_ancestry_disambiguates_and_none
2026-08-18T01:31:05.5190396Z         PASS [   0.290s] ( 557/2579) spt::bin/spt roster::tests::enumerate_yields_offline_corrupt_row_for_unparseable_info
2026-08-18T01:31:05.5191155Z         PASS [   0.297s] ( 558/2579) spt::bin/spt roster::tests::enumerate_nested_keeps_a_child_whose_name_has_no_kind_suffix
2026-08-18T01:31:05.5205570Z         PASS [   0.244s] ( 559/2579) spt::bin/spt roster::tests::list_all_perch_dirs_enumerates_nested_psyche_for_self_resolution
2026-08-18T01:31:05.5575574Z         PASS [   0.233s] ( 560/2579) spt::bin/spt roster::tests::parent_pid_candidates_stay_ancestry_gated
2026-08-18T01:31:05.5924312Z         PASS [   0.240s] ( 561/2579) spt::bin/spt teardown::tests::an_unconfirmed_row_over_a_dead_root_is_stale_not_a_survivor
2026-08-18T01:31:05.5961473Z         PASS [   0.228s] ( 562/2579) spt::bin/spt teardown::tests::timeout_refuses_the_stamp_and_names_the_survivor
2026-08-18T01:31:05.5997249Z         PASS [   0.153s] ( 563/2579) spt::bin/spt tests::broken_pipe_panic_classifier
2026-08-18T01:31:05.6025297Z         PASS [   0.166s] ( 564/2579) spt::bin/spt teardown::tests::topology_gate_is_controllable_true_only
2026-08-18T01:31:05.6828805Z         PASS [   0.274s] ( 565/2579) spt::bin/spt api::startup::tests::prebind_refusal_restores_the_seed_for_retry
2026-08-18T01:31:05.6829649Z         PASS [   0.313s] ( 566/2579) spt::bin/spt teardown::tests::liveness_proof_needs_a_real_snapshot_and_finds_this_process
2026-08-18T01:31:05.6830449Z         PASS [   0.159s] ( 567/2579) spt::bin/spt trustwarnverb::tests::a_refusal_names_the_verb_the_endpoint_and_the_reason
2026-08-18T01:31:05.6864821Z         PASS [   0.167s] ( 568/2579) spt::bin/spt trustwarnverb::tests::showing_the_warning_is_never_elevation_gated
2026-08-18T01:31:05.6982044Z         PASS [   0.206s] ( 569/2579) spt::bin/spt tests::the_sized_stack_wrapper_maps_a_panic_to_the_main_thread_code
2026-08-18T01:31:05.6986127Z         PASS [   0.178s] ( 570/2579) spt::bin/spt trustwarnverb::tests::the_gate_keys_on_whether_the_verb_writes
2026-08-18T01:31:05.7446117Z         PASS [   0.206s] ( 571/2579) spt::bin/spt trustwarnverb::tests::writing_an_override_requires_confirmed_elevation
2026-08-18T01:31:05.7449520Z         PASS [   0.153s] ( 572/2579) spt::bin/spt unlisted::tests::a_cross_node_knock_says_answer_unknown_while_a_same_node_one_says_approved
2026-08-18T01:31:05.8130546Z         PASS [   0.217s] ( 573/2579) spt::bin/spt unlisted::tests::a_rule_only_row_has_no_node_to_route_to
2026-08-18T01:31:05.8188890Z         PASS [   0.220s] ( 574/2579) spt::bin/spt unlisted::tests::an_exclusion_and_an_unheard_of_id_are_different_refusals
2026-08-18T01:31:05.9007053Z         PASS [   0.290s] ( 575/2579) spt::bin/spt unlisted::tests::an_exclusion_outranks_the_strongest_evidence
2026-08-18T01:31:05.9237291Z         PASS [   0.256s] ( 576/2579) spt::bin/spt api::startup::tests::read_env_measured_capture_replaces_prior_stamp
2026-08-18T01:31:05.9247341Z         PASS [   0.247s] ( 577/2579) spt::bin/spt unlisted::tests::contact_evidence_outside_the_window_produces_no_row
2026-08-18T01:31:05.9274531Z         PASS [   0.260s] ( 578/2579) spt::bin/spt unlisted::tests::an_inbound_knock_is_never_read_as_our_own_outbound_act
2026-08-18T01:31:06.0121995Z         PASS [   0.325s] ( 579/2579) spt::bin/spt unlisted::tests::listed_local_and_excluded_rows_are_dropped_and_the_rest_survive
2026-08-18T01:31:06.0224825Z         PASS [   0.323s] ( 580/2579) spt::bin/spt unlisted::tests::no_evidence_phrase_claims_liveness
2026-08-18T01:31:06.0236000Z         PASS [   0.325s] ( 581/2579) spt::bin/spt unlisted::tests::no_knock_evidence_phrase_claims_liveness
2026-08-18T01:31:06.0885099Z         PASS [   0.343s] ( 582/2579) spt::bin/spt unlisted::tests::rule_evidence_carries_no_node_and_contact_evidence_does
2026-08-18T01:31:06.0906975Z         PASS [   0.345s] ( 583/2579) spt::bin/spt unlisted::tests::the_relative_stamp_is_coarse_and_has_no_zero_forms
2026-08-18T01:31:06.1624030Z         PASS [   0.342s] ( 584/2579) spt::bin/spt unlisted::tests::the_strongest_provenance_labels_the_row_and_a_weaker_one_supplies_the_node
2026-08-18T01:31:06.1653288Z         PASS [   0.352s] ( 585/2579) spt::bin/spt unlisted::tests::the_route_refuses_an_excluded_id_and_admits_a_non_excluded_one
2026-08-18T01:31:06.2193024Z         PASS [   0.328s] ( 586/2579) spt-daemon access::tests::a_fork_grant_admits_fork_and_nothing_else_admits_fork
2026-08-18T01:31:06.2257758Z         PASS [   0.301s] ( 587/2579) spt-daemon access::tests::a_sender_endpoint_rule_does_not_admit_a_fork
2026-08-18T01:31:06.2509719Z         PASS [   0.323s] ( 588/2579) spt-daemon access::tests::corrupt_store_degrades_closed_but_replies_survive
2026-08-18T01:31:06.2614734Z         PASS [   0.242s] ( 589/2579) spt-daemon access::tests::discover_gate_withholds_everything_while_degraded
2026-08-18T01:31:06.2648593Z         PASS [   0.253s] ( 590/2579) spt-daemon access::tests::discover_gate_discloses_per_viewer
2026-08-18T01:31:06.2796348Z         PASS [   0.192s] ( 591/2579) spt-daemon access::tests::gate_feeds_the_proven_sender_endpoint_tier
2026-08-18T01:31:06.2800490Z         PASS [   0.256s] ( 592/2579) spt-daemon access::tests::gate_decision_table
2026-08-18T01:31:06.3268072Z         PASS [   0.395s] ( 593/2579) spt::bin/spt api::startup::tests::rebind_same_session_ok
2026-08-18T01:31:06.3401548Z         PASS [   0.243s] ( 594/2579) spt-daemon access::tests::gate_is_per_surface
2026-08-18T01:31:06.3511805Z         PASS [   0.133s] ( 595/2579) spt-daemon access::tests::the_decision_helpers_split_pass_from_refusal_for_every_reason
2026-08-18T01:31:06.3518882Z         PASS [   0.191s] ( 596/2579) spt-daemon access::tests::reply_passes_where_unsolicited_refused
2026-08-18T01:31:06.3729175Z         PASS [   0.208s] ( 597/2579) spt-daemon access::tests::same_node_always_passes_without_minting
2026-08-18T01:31:06.4052144Z         PASS [   0.144s] ( 598/2579) spt-daemon access::tests::the_inbound_lock_answers_replies_only_and_only_while_controlled
2026-08-18T01:31:06.4240473Z         PASS [   0.173s] ( 599/2579) spt-daemon access::tests::the_engine_room_refuses_even_this_nodes_own_unsolicited_inbound
2026-08-18T01:31:06.4610255Z         PASS [   0.229s] ( 600/2579) spt-daemon access::tests::the_engine_room_is_disclosed_only_to_the_viewers_it_chose
2026-08-18T01:31:06.4745816Z         PASS [   0.195s] ( 601/2579) spt-daemon access::tests::the_knock_exemption_hook_refuses_everything_today
2026-08-18T01:31:06.4903759Z         PASS [   0.225s] ( 602/2579) spt-daemon access::tests::the_inbound_lock_is_reached_through_the_sender_stamped_entry_point
2026-08-18T01:31:06.5835364Z         PASS [   7.381s] ( 603/2579) spt::bin/spt cli::tests::the_monic_command_path_treats_a_husk_as_present
2026-08-18T01:31:06.5926549Z         PASS [   0.312s] ( 604/2579) spt-daemon access::tests::the_pass_reason_names_which_arm_admitted_the_interaction
2026-08-18T01:31:06.5937041Z         PASS [   0.260s] ( 605/2579) spt-daemon access::tests::the_trust_warning_fires_only_for_an_entry_admitted_stranger
2026-08-18T01:31:06.6633905Z         PASS [   0.312s] ( 606/2579) spt-daemon access::tests::the_wire_origin_stamp_reaches_the_chain
2026-08-18T01:31:06.6701691Z         PASS [   0.318s] ( 607/2579) spt-daemon activity::tests::a_state_change_owes_a_push_both_directions
2026-08-18T01:31:06.7137731Z         PASS [   0.341s] ( 608/2579) spt-daemon activity::tests::a_token_change_with_an_identical_state_owes_a_push
2026-08-18T01:31:06.7581353Z         PASS [   0.436s] ( 609/2579) spt::bin/spt api::startup::tests::revive_preserves_prior_rest_state_and_dormant_anchor
2026-08-18T01:31:06.7708349Z         PASS [   0.366s] ( 610/2579) spt-daemon activity::tests::an_identical_observation_pushes_nothing
2026-08-18T01:31:06.8411646Z         PASS [   0.417s] ( 611/2579) spt-daemon activity::tests::an_owner_with_no_linked_shell_is_not_observed
2026-08-18T01:31:06.8801353Z         PASS [   0.426s] ( 612/2579) spt-daemon activity::tests::an_unseen_link_owes_a_push
2026-08-18T01:31:06.9484254Z         PASS [   0.474s] ( 613/2579) spt-daemon activity::tests::an_unstamped_owner_observes_undated_and_stays_silent_across_sweeps
2026-08-18T01:31:07.0281409Z         PASS [   0.538s] ( 614/2579) spt-daemon activity::tests::observe_links_on_an_absent_owlery_is_empty
2026-08-18T01:31:07.0952171Z         PASS [   0.512s] ( 615/2579) spt-daemon activity::tests::observe_links_sees_only_online_shells_holding_a_token
2026-08-18T01:31:07.1786105Z         PASS [   0.586s] ( 616/2579) spt-daemon activity::tests::remember_forgets_a_vanished_link_so_its_return_re_pushes
2026-08-18T01:31:07.2737710Z         PASS [   0.680s] ( 617/2579) spt-daemon activity::tests::the_diff_is_per_link_not_per_owner
2026-08-18T01:31:07.3815689Z         PASS [   0.718s] ( 618/2579) spt-daemon activity::tests::the_flip_marker_is_idempotent_to_drop_and_taken_exactly_once
2026-08-18T01:31:07.5449566Z         PASS [   0.875s] ( 619/2579) spt-daemon adapter_update::tests::delegated_attested_delegates_command
2026-08-18T01:31:07.7981278Z         PASS [   1.084s] ( 620/2579) spt-daemon adapter_update::tests::delegated_unattested_is_skipped
2026-08-18T01:31:08.1508037Z         PASS [   1.380s] ( 621/2579) spt-daemon adapter_update::tests::file_pull_tampered_bytes_rejected
2026-08-18T01:31:08.2133549Z         PASS [   1.459s] ( 622/2579) spt::bin/spt api::startup::tests::revive_without_cwd_preserves_prior_cwd
2026-08-18T01:31:08.4933282Z         PASS [   1.632s] ( 623/2579) spt-daemon adapter_update::tests::file_pull_verified_against_adapter_key
2026-08-18T01:31:08.4997640Z         PASS [   1.459s] ( 624/2579) spt-daemon adapter_update::tests::gh_release_is_managed_cli_side_not_in_pure_plan
2026-08-18T01:31:08.5656622Z         PASS [   1.623s] ( 625/2579) spt-daemon adapter_update::tests::file_pull_without_payload_is_skipped
2026-08-18T01:31:08.5737559Z         PASS [   1.417s] ( 626/2579) spt-daemon adapter_update::tests::ripple_conducts_each_adapter_in_order
2026-08-18T01:31:08.5841413Z         PASS [   1.574s] ( 627/2579) spt-daemon adapter_update::tests::file_pull_wrong_key_rejected
2026-08-18T01:31:08.6067508Z         PASS [   1.223s] ( 628/2579) spt-daemon answerop::tests::a_receipt_fires_only_from_the_node_the_knock_was_sent_to
2026-08-18T01:31:08.6386038Z         PASS [   0.425s] ( 629/2579) spt::bin/spt api::startup::tests::seed_bind_records_seed_captured_cwd
2026-08-18T01:31:08.6500732Z         PASS [   0.155s] ( 630/2579) spt-daemon attach::tests::the_engine_room_has_no_viewport_and_takes_its_controls_from_home
2026-08-18T01:31:08.6501785Z         PASS [   0.173s] ( 631/2579) spt-daemon answerop::tests::an_unknown_outcome_token_acts_on_nothing
2026-08-18T01:31:08.6532107Z         PASS [   0.131s] ( 632/2579) spt-daemon autostart::tests::empty_config_is_a_pure_noop
2026-08-18T01:31:08.6994678Z         PASS [   0.057s] ( 633/2579) spt::bin/spt api::startup::tests::seed_fail_eof_gives_actionable_stale_broker_hint
2026-08-18T01:31:08.6995594Z         PASS [   0.193s] ( 634/2579) spt-daemon attach::tests::viewer_and_driving_intents_gate_on_different_surfaces
2026-08-18T01:31:08.6996295Z         PASS [   0.093s] ( 635/2579) spt-daemon autostart::tests::unresolved_adapter_loud_skips_before_any_launch
2026-08-18T01:31:08.7380442Z         PASS [   0.096s] ( 636/2579) spt-daemon brain::tests::a_flagged_sync_frame_baselines_forward_never_backward_on_both_paths
2026-08-18T01:31:08.7390196Z         PASS [   0.086s] ( 637/2579) spt-daemon brain::tests::cold_brain_still_rejects_a_forward_output_gap
2026-08-18T01:31:08.7419485Z         PASS [   1.562s] ( 638/2579) spt-daemon adapter_update::tests::ripple_registered_uses_the_registered_set
2026-08-18T01:31:08.7420349Z         PASS [   0.095s] ( 639/2579) spt-daemon brain::tests::an_old_broker_wire_without_the_sync_key_keeps_every_legacy_path
2026-08-18T01:31:08.7462033Z         PASS [   0.050s] ( 640/2579) spt::bin/spt api::startup::tests::seed_restorable_spends_dead_seeds_restores_recoverable
2026-08-18T01:31:08.7544751Z         PASS [   0.057s] ( 641/2579) spt-daemon brain::tests::controller_resume_from_floor_refetches_after_a_gap
2026-08-18T01:31:08.8406545Z         PASS [   1.542s] ( 642/2579) spt-daemon answerop::tests::a_denial_disarms_but_only_when_it_is_proven
2026-08-18T01:31:08.8627237Z         PASS [   0.151s] ( 643/2579) spt-daemon brain::tests::peer_reply_deadline_caps_below_carrier_deadline
2026-08-18T01:31:08.9111671Z         PASS [   0.135s] ( 644/2579) spt-daemon brain::tests::reclassify_peer_reply_maps_timeout_off_poison
2026-08-18T01:31:08.9112664Z         PASS [   0.152s] ( 645/2579) spt-daemon brainproc::tests::backoff_doubles_on_fast_death_resets_when_healthy
2026-08-18T01:31:08.9182647Z         PASS [   0.177s] ( 646/2579) spt-daemon brain::tests::skip_to_live_accepts_a_forward_seq_jump_via_snap_above
2026-08-18T01:31:08.9266557Z         PASS [   0.184s] ( 647/2579) spt-daemon brain::tests::viewer_snap_attach_accepts_a_forward_output_gap
2026-08-18T01:31:08.9414008Z         PASS [   0.184s] ( 648/2579) spt::bin/spt api::startup::tests::session_id_fallback_binds_live_perch_from_sid
2026-08-18T01:31:08.9414665Z         PASS [   0.086s] ( 649/2579) spt-daemon brainproc::tests::bytes_gate_truth_table
2026-08-18T01:31:08.9459378Z         PASS [   0.204s] ( 650/2579) spt-daemon brainproc::tests::appended_padding_flips_exe_hash
2026-08-18T01:31:08.9508768Z         PASS [   0.795s] ( 651/2579) spt-daemon answerop::tests::an_approval_notifies_a_plain_knocker_with_no_pre_authorization
2026-08-18T01:31:08.9532671Z         PASS [   0.048s] ( 652/2579) spt-daemon brainproc::tests::consumer_gate_spawns_once_when_net_enabled
2026-08-18T01:31:09.0136256Z         PASS [   0.074s] ( 653/2579) spt-daemon brainproc::tests::planned_restart_respawns_with_update_reason
2026-08-18T01:31:09.0137483Z         PASS [   0.078s] ( 654/2579) spt::bin/spt api::startup::tests::session_id_fallback_refuses_a_psyche_custody_sid
2026-08-18T01:31:09.0152915Z         PASS [   1.466s] ( 655/2579) spt-daemon answerop::tests::a_receipt_for_a_knock_we_never_sent_notifies_nobody
2026-08-18T01:31:09.0156570Z         PASS [   0.196s] ( 656/2579) spt-daemon brainproc::tests::brain_child_args_carry_generation_and_reason
2026-08-18T01:31:09.0543104Z         PASS [   1.256s] ( 657/2579) spt-daemon answerop::tests::a_receipt_from_the_wrong_answerer_or_a_replayed_one_acts_on_nothing
2026-08-18T01:31:09.0883785Z         PASS [   0.131s] ( 658/2579) spt-daemon brainproc::tests::ready_exe_hash_parses_and_is_n1_readable
2026-08-18T01:31:09.1603419Z         PASS [   0.133s] ( 659/2579) spt-daemon brainproc::tests::ready_generation_at_reads_file_and_absent_is_none
2026-08-18T01:31:09.1988229Z         PASS [   0.187s] ( 660/2579) spt::bin/spt api::startup::tests::session_id_fallback_refuses_empty_sid_and_dead_anchor
2026-08-18T01:31:09.3595055Z         PASS [   0.314s] ( 661/2579) spt-daemon brainproc::tests::ready_generation_parses_stamp_and_fails_safe
2026-08-18T01:31:09.3595761Z         PASS [   0.380s] ( 662/2579) spt-daemon brainproc::tests::ready_but_wrong_bytes_rolls_back_never_promotes
2026-08-18T01:31:09.3596463Z         PASS [   0.302s] ( 663/2579) spt-daemon brainproc::tests::rollback_running_version_is_prior_not_n_minus_one
2026-08-18T01:31:09.3597127Z         PASS [   0.161s] ( 664/2579) spt::bin/spt api::startup::tests::stale_seed_refusal_spends_the_seed_no_restore
2026-08-18T01:31:09.3749572Z         PASS [   0.280s] ( 665/2579) spt-daemon brainproc::tests::rolled_back_record_spawns_rollback_binary_on_a_fresh_supervisor
2026-08-18T01:31:09.3887497Z         PASS [   0.253s] ( 666/2579) spt-daemon brainproc::tests::select_brain_exe_prefers_canonical_over_per_spawn_current_exe
2026-08-18T01:31:09.4794318Z         PASS [   0.503s] ( 667/2579) spt-daemon brainproc::tests::ready_but_old_gen_never_drains_does_not_promote_rolls_back
2026-08-18T01:31:09.5609754Z         PASS [   0.201s] ( 668/2579) spt-daemon brainproc::tests::start_reason_arg_round_trips_and_is_lenient
2026-08-18T01:31:09.5619103Z         PASS [   0.202s] ( 669/2579) spt::bin/spt api::startup::tests::stale_seed_with_dead_anchor_refused
2026-08-18T01:31:09.6329719Z         LEAK [   0.709s] ( 670/2579) spt-daemon brainproc::tests::clear_before_spawn_defeats_exact_generation_stale_file
2026-08-18T01:31:09.6330572Z         PASS [   0.662s] ( 671/2579) spt-daemon brainproc::tests::ready_candidate_promotes_once_old_gen_drains
2026-08-18T01:31:09.6331178Z         PASS [   0.599s] ( 672/2579) spt-daemon brainproc::tests::ready_with_matching_bytes_promotes
2026-08-18T01:31:09.7444366Z         PASS [   0.176s] ( 673/2579) spt::bin/spt api::startup::tests::successful_bind_consumes_the_seed_exactly_once
2026-08-18T01:31:09.8483596Z         PASS [   0.260s] ( 674/2579) spt-daemon codec::tests::back_to_back_frames_decode_independently
2026-08-18T01:31:09.8811824Z         PASS [   0.263s] ( 675/2579) spt-daemon codec::tests::frame_round_trips_through_buffer
2026-08-18T01:31:10.0643349Z         PASS [   0.320s] ( 676/2579) spt-daemon codec::tests::oversized_prefix_rejected
2026-08-18T01:31:10.0675218Z         PASS [   0.205s] ( 677/2579) spt-daemon config::tests::auto_suspend_knob_is_opt_in_default_off
2026-08-18T01:31:10.1275887Z         PASS [   0.749s] ( 678/2579) spt-daemon brainproc::tests::stale_generation_minus_one_ready_never_promotes
2026-08-18T01:31:10.2187993Z         PASS [   1.701s] ( 679/2579) spt-daemon autostart::tests::a_persisted_reserved_id_default_is_never_replayed
2026-08-18T01:31:10.2188666Z         PASS [   0.345s] ( 680/2579) spt-daemon config::tests::crash_grace_is_config_driven
2026-08-18T01:31:10.2189249Z         PASS [   0.285s] ( 681/2579) spt-daemon config::tests::detached_subnets_knob_defaults_empty
2026-08-18T01:31:10.2512358Z         PASS [   0.175s] ( 682/2579) spt-daemon config::tests::full_auto_update_is_gated_by_default
2026-08-18T01:31:10.2513021Z         PASS [   0.174s] ( 683/2579) spt-daemon config::tests::malformed_file_degrades_to_default
2026-08-18T01:31:10.2828747Z         PASS [   0.066s] ( 684/2579) spt-daemon config::tests::pulse_period_is_config_driven
2026-08-18T01:31:10.2982950Z         PASS [   0.084s] ( 685/2579) spt-daemon config::tests::missing_file_is_default
2026-08-18T01:31:10.3742942Z         PASS [   0.124s] ( 686/2579) spt-daemon config::tests::relay_choice_is_config_driven
2026-08-18T01:31:10.4042988Z         PASS [   0.180s] ( 687/2579) spt-daemon config::tests::remove_startup_endpoint_takes_one_entry_and_reports_whether_there_was_one
2026-08-18T01:31:10.4076140Z         PASS [   0.968s] ( 688/2579) spt-daemon brainproc::tests::trial_promotes_on_ready_then_supervises_the_accepted_binary
2026-08-18T01:31:10.4465077Z         PASS [   0.188s] ( 689/2579) spt-daemon config::tests::save_load_roundtrip
2026-08-18T01:31:10.4741809Z         PASS [   0.188s] ( 690/2579) spt-daemon config::tests::startup_endpoints_roundtrip
2026-08-18T01:31:10.5898810Z         PASS [  12.889s] ( 691/2579) spt::bin/spt cli::tests::shell_spawn_gates_on_the_registered_set
2026-08-18T01:31:10.5899867Z         PASS [   0.292s] ( 692/2579) spt-daemon config::tests::upsert_startup_endpoint_appends_then_replaces_preserving_other_knobs
2026-08-18T01:31:10.6563731Z         PASS [   0.265s] ( 693/2579) spt-daemon conn::tests::conn_ids_are_unique_and_labels_stay_bounded
2026-08-18T01:31:10.6764424Z         PASS [   1.289s] ( 694/2579) spt-daemon brainproc::tests::trial_kills_alive_never_ready_candidate_before_rollback
2026-08-18T01:31:10.6856595Z         PASS [   0.247s] ( 695/2579) spt-daemon consent::tests::decide_honors_full_auto_flag
2026-08-18T01:31:10.6873307Z         PASS [   0.280s] ( 696/2579) spt-daemon conn::tests::retirement_token_splits_deadline_from_organic_with_attribution_parity
2026-08-18T01:31:10.6877163Z         PASS [   0.284s] ( 697/2579) spt-daemon conn::tests::organic_write_failure_still_poisons_and_is_not_the_timeout_class
2026-08-18T01:31:10.7366760Z         PASS [   1.359s] ( 698/2579) spt-daemon brainproc::tests::supervisor_respawns_brain_until_stopped
2026-08-18T01:31:10.7926480Z         PASS [   0.296s] ( 699/2579) spt-daemon consent::tests::no_live_session_resolves_to_none
2026-08-18T01:31:10.8771508Z         PASS [   0.158s] ( 700/2579) spt-daemon crc_swap::tests::crash_recovery_missing_target_keeps_last_good_old
2026-08-18T01:31:10.8777300Z         PASS [   1.475s] ( 701/2579) spt-daemon brainproc::tests::supervisor_owns_generation_and_stamps_start_reason
2026-08-18T01:31:10.8987005Z         PASS [   0.294s] ( 702/2579) spt-daemon consent::tests::resolves_most_recently_active_live_session
2026-08-18T01:31:10.8989102Z         PASS [   0.182s] ( 703/2579) spt-daemon crc_swap::tests::plan_recurses_nested_dirs
2026-08-18T01:31:10.8990420Z         PASS [   0.263s] ( 704/2579) spt-daemon crc_swap::tests::apply_swaps_changed_creates_new_untouched_identical
2026-08-18T01:31:10.9028180Z         PASS [   1.370s] ( 705/2579) spt-daemon brainproc::tests::trial_rolls_back_after_budget_of_pre_ready_exits
2026-08-18T01:31:10.9029126Z         PASS [   0.213s] ( 706/2579) spt-daemon crc_swap::tests::displace_picks_fresh_old_name_and_gc_sweeps_stale
2026-08-18T01:31:10.9687791Z         PASS [   0.374s] ( 707/2579) spt-daemon crc_swap::tests::apply_rollback_never_strands
2026-08-18T01:31:10.9800541Z         PASS [   0.255s] ( 708/2579) spt-daemon crc_swap::tests::plan_selects_only_changed
2026-08-18T01:31:10.9922070Z         PASS [   0.223s] ( 709/2579) spt-daemon crc_swap::tests::swap_error_carries_op_and_paths
2026-08-18T01:31:11.0892931Z         PASS [   0.199s] ( 710/2579) spt-daemon daemon::tests::a_captured_spawn_inherits_only_the_handle_in_its_allowlist
2026-08-18T01:31:11.1038548Z         PASS [   0.140s] ( 711/2579) spt-daemon daemon::tests::drive_ladder_all_err_returns_last_err
2026-08-18T01:31:11.1811564Z         PASS [   0.321s] ( 712/2579) spt-daemon daemon::tests::a_failed_job_termination_announces_the_tree_loss
2026-08-18T01:31:11.1812470Z         PASS [   0.185s] ( 713/2579) spt-daemon daemon::tests::drive_ladder_falls_through_to_next_rung_on_err
2026-08-18T01:31:11.1858590Z         PASS [   0.291s] ( 714/2579) spt-daemon daemon::tests::an_ordinary_teardown_announces_nothing
2026-08-18T01:31:11.1905087Z         PASS [   0.200s] ( 715/2579) spt-daemon daemon::tests::drive_ladder_picks_first_ok_rung
2026-08-18T01:31:11.2996612Z         PASS [   0.384s] ( 716/2579) spt-daemon daemon::tests::a_scrubbed_variable_never_reaches_the_child
2026-08-18T01:31:11.2997368Z         PASS [   0.571s] ( 717/2579) spt-daemon crc_swap::tests::mapped_old_does_not_brick_apply_displaces_aside
2026-08-18T01:31:11.3583794Z         PASS [   0.175s] ( 718/2579) spt-daemon daemon::tests::is_running_tracks_the_seed_channel
2026-08-18T01:31:11.3590418Z         PASS [   0.296s] ( 719/2579) spt-daemon daemon::tests::ensure_declines_only_against_a_standing_operator_stop
2026-08-18T01:31:11.3591231Z         PASS [   0.236s] ( 720/2579) spt-daemon daemon::tests::implicit_ensure_declines_without_clearing_the_inhibit
2026-08-18T01:31:11.3591978Z         PASS [   0.181s] ( 721/2579) spt-daemon daemon::tests::net_retry_backoff_doubles_then_caps
2026-08-18T01:31:11.3698440Z         PASS [   0.208s] ( 722/2579) spt-daemon daemon::tests::launch_ladder_order_is_wmi_schtasks_breakaway_injob
2026-08-18T01:31:11.3712668Z         PASS [   0.180s] ( 723/2579) spt-daemon daemon::tests::null_std_handles_only_on_a_pipe_stderr
2026-08-18T01:31:11.3776532Z         PASS [   0.119s] ( 724/2579) spt-daemon daemon::tests::the_refusal_line_names_the_remedy
2026-08-18T01:31:11.4452459Z         PASS [   0.102s] ( 725/2579) spt-daemon daemon::tests::the_tree_loss_line_names_the_loss_not_the_syscall
2026-08-18T01:31:11.4476296Z         PASS [   0.116s] ( 726/2579) spt-daemon daemon::tests::windows_arg_quoting_roundtrips_the_rules
2026-08-18T01:31:11.5554986Z         PASS [   0.213s] ( 727/2579) spt-daemon daemon::tests::wmi_create_script_carries_the_no_window_startup_spec
2026-08-18T01:31:11.5745386Z         PASS [   0.228s] ( 728/2579) spt-daemon deadline::tests::advance_after_fire_steps_one_grid_normally_and_collapses_a_stall
2026-08-18T01:31:11.5749087Z         PASS [   0.202s] ( 729/2579) spt-daemon deadline::tests::cold_and_crash_write_fresh_anchor_at_now
2026-08-18T01:31:11.6168063Z         PASS [   0.247s] ( 730/2579) spt-daemon deadline::tests::corrupt_file_degrades_to_fresh
2026-08-18T01:31:11.6176109Z         PASS [   2.702s] ( 731/2579) spt-daemon brainproc::tests::exe_hash_computed_exactly_once_across_n_publishes
2026-08-18T01:31:11.6568345Z         PASS [   0.221s] ( 732/2579) spt-daemon deadline::tests::next_fire_between_grid_points_rounds_up
2026-08-18T01:31:11.6751951Z         PASS [   0.771s] ( 733/2579) spt-daemon daemon::tests::detached_no_inherit_falls_back_under_a_breakaway_denying_job
2026-08-18T01:31:11.6767986Z         PASS [   0.295s] ( 734/2579) spt-daemon deadline::tests::distinct_keys_do_not_cross_clobber
2026-08-18T01:31:11.6768624Z         PASS [   0.777s] ( 735/2579) spt-daemon daemon::tests::breakaway_spawn_escapes_a_kill_on_close_job
2026-08-18T01:31:11.6771356Z         PASS [   0.231s] ( 736/2579) spt-daemon deadline::tests::next_fire_long_jump_collapses_missed_ticks_to_one
2026-08-18T01:31:11.6896871Z         PASS [   0.439s] ( 737/2579) spt-daemon daemon::tests::spawn_env_additions_reach_the_child_and_keep_the_inherited_environment
2026-08-18T01:31:11.8094183Z         PASS [   0.940s] ( 738/2579) spt-daemon daemon::tests::a_tree_teardown_reaches_a_grandchild_the_service_spawned
2026-08-18T01:31:11.8285224Z         PASS [   0.259s] ( 739/2579) spt-daemon deadline::tests::next_fire_on_grid_returns_now_and_advances_strictly
2026-08-18T01:31:11.8287218Z         PASS [   0.247s] ( 740/2579) spt-daemon deadline::tests::one_shot_fires_at_or_after_target_and_never_resets
2026-08-18T01:31:11.8491816Z         PASS [   0.275s] ( 741/2579) spt-daemon deadline::tests::next_fire_saturates_when_now_precedes_anchor
2026-08-18T01:31:11.8672606Z         PASS [   0.250s] ( 742/2579) spt-daemon deadline::tests::update_keeps_anchor_and_refreshes_interval
2026-08-18T01:31:11.8673236Z         PASS [   0.250s] ( 743/2579) spt-daemon deadline::tests::update_with_no_file_falls_back_fresh
2026-08-18T01:31:11.8723461Z         PASS [   0.221s] ( 744/2579) spt-daemon deadline::tests::zero_interval_degrades_to_config_default
2026-08-18T01:31:11.9307774Z         PASS [   0.260s] ( 745/2579) spt-daemon deelevate::tests::env_overlay_keeps_explicit_spt_home_alive
2026-08-18T01:31:11.9315391Z         PASS [   0.259s] ( 746/2579) spt-daemon deelevate::tests::plan_spawn_deelevates_only_with_a_target
2026-08-18T01:31:11.9353692Z         PASS [   0.261s] ( 747/2579) spt-daemon digest::tests::common_prefix_len_finds_the_unchanged_head
2026-08-18T01:31:12.0257419Z         PASS [   0.194s] ( 748/2579) spt-daemon digest::tests::merge_by_ts_interleaves_context
2026-08-18T01:31:12.0258034Z         PASS [   0.336s] ( 749/2579) spt-daemon digest::tests::log_less_two_origin_merge_interleaves_by_ts
2026-08-18T01:31:12.0423461Z         PASS [   0.195s] ( 750/2579) spt-daemon digest::tests::resolve_config_precedence
2026-08-18T01:31:12.0500971Z         PASS [   0.231s] ( 751/2579) spt-daemon digest::tests::projects_empty_for_a_sourceless_endpoint
2026-08-18T01:31:12.0638258Z         PASS [   0.245s] ( 752/2579) spt-daemon digest::tests::projects_a_log_less_endpoint_from_digest_log
2026-08-18T01:31:12.0638977Z         PASS [   0.194s] ( 753/2579) spt-daemon digest::tests::supersede_is_noop_on_disjoint_sessions
2026-08-18T01:31:12.0639580Z         PASS [   0.189s] ( 754/2579) spt-daemon digest::tests::supersede_keeps_within_generation_repeats
2026-08-18T01:31:12.0666149Z         PASS [   0.137s] ( 755/2579) spt-daemon digest::tests::supersede_trims_divider_around_emptied_middle_generation
2026-08-18T01:31:12.0777153Z         PASS [   0.206s] ( 756/2579) spt-daemon digest::tests::supersede_collapses_cross_generation_replay_to_newest
2026-08-18T01:31:12.0779548Z         PASS [   0.071s] ( 757/2579) spt-daemon digesthub::tests::publish_delta_is_tail_then_full_refresh
2026-08-18T01:31:12.0830411Z         PASS [   0.147s] ( 758/2579) spt-daemon digesthub::tests::project_and_publish_stores_latest
2026-08-18T01:31:12.0845334Z         PASS [   0.153s] ( 759/2579) spt-daemon digesthub::tests::dropped_subscriber_is_pruned
2026-08-18T01:31:12.1581687Z         PASS [  15.734s] ( 760/2579) spt::bin/spt cli::tests::purge_removes_every_record
2026-08-18T01:31:12.1582711Z         PASS [   0.130s] ( 761/2579) spt-daemon digesthub::tests::render_is_glanceable
2026-08-18T01:31:12.1809566Z         PASS [   0.118s] ( 762/2579) spt-daemon dispatch::tests::a_fork_record_is_never_read_as_a_message_and_an_old_daemon_drops_it
2026-08-18T01:31:12.1994223Z         PASS [   0.128s] ( 763/2579) spt-daemon dispatch::tests::a_receipt_is_never_read_as_a_message_and_never_as_a_knock
2026-08-18T01:31:12.1995186Z         PASS [   0.133s] ( 764/2579) spt-daemon dispatch::tests::a_knock_record_routes_here_and_drops_cleanly_on_an_n1_daemon
2026-08-18T01:31:12.1996226Z         PASS [   0.115s] ( 765/2579) spt-daemon dispatch::tests::breaker_trips_with_doubling_capped_window_and_resets_on_progress
2026-08-18T01:31:12.1997147Z         PASS [   0.131s] ( 766/2579) spt-daemon dispatch::tests::a_redemption_is_dropped_by_an_old_daemon_where_a_knock_field_would_have_been_accepted
2026-08-18T01:31:12.2045722Z         PASS [   0.143s] ( 767/2579) spt-daemon dispatch::tests::a_presence_record_classifies_as_its_own_family_and_never_as_a_message
2026-08-18T01:31:12.2068215Z         PASS [   0.165s] ( 768/2579) spt-daemon digesthub::tests::subscribe_returns_current_base
2026-08-18T01:31:12.2096496Z         PASS [   0.125s] ( 769/2579) spt-daemon dispatch::tests::classifies_every_family_by_first_line_shape
2026-08-18T01:31:12.2703897Z         PASS [   2.534s] ( 770/2579) spt::bin/spt api::startup::tests::the_escape_the_refusal_names_actually_clears_it
2026-08-18T01:31:12.2959940Z         PASS [   0.221s] ( 771/2579) spt-daemon dispatch::tests::an_unadmitted_asker_is_refused_at_this_nodes_own_seam
2026-08-18T01:31:12.3651049Z         PASS [   0.292s] ( 772/2579) spt-daemon dispatch::tests::a_served_probe_leaves_the_targets_spool_and_inbox_byte_identical
2026-08-18T01:31:12.4393516Z         PASS [   0.307s] ( 773/2579) spt-daemon dispatch::tests::classify_failure_seat_blocked_is_exactly_the_three_discipline_strings
2026-08-18T01:31:12.4626939Z         PASS [   0.307s] ( 774/2579) spt-daemon dispatch::tests::cold_enumeration_claims_at_most_the_pool_bound_per_poll
2026-08-18T01:31:12.4666551Z         PASS [   0.299s] ( 775/2579) spt-daemon dispatch::tests::digest_pull_and_rest_never_read_as_each_other
2026-08-18T01:31:12.4736340Z         PASS [   0.276s] ( 776/2579) spt-daemon dispatch::tests::feed_accumulator_commits_per_bound_never_per_chunk
2026-08-18T01:31:12.4745480Z         PASS [   0.284s] ( 777/2579) spt-daemon dispatch::tests::dispatch_event_carries_the_complete_key_set
2026-08-18T01:31:12.4757564Z         PASS [   0.284s] ( 778/2579) spt-daemon dispatch::tests::each_presence_word_has_exactly_one_authority
2026-08-18T01:31:12.4758408Z         PASS [   0.278s] ( 779/2579) spt-daemon dispatch::tests::finished_is_terminal_for_attach_only
2026-08-18T01:31:12.4791355Z         PASS [   0.275s] ( 780/2579) spt-daemon dispatch::tests::line_endpoint_resolves_each_family_identity_key
2026-08-18T01:31:12.4815152Z         PASS [   0.275s] ( 781/2579) spt-daemon dispatch::tests::oneway_seatblocked_strikes_out_terminal_while_request_reply_paces_forever
2026-08-18T01:31:12.5036127Z         PASS [   0.826s] ( 782/2579) spt-daemon digest::tests::extractor_spans_sessions_with_a_boundary_marker
2026-08-18T01:31:12.5444186Z         PASS [   0.333s] ( 783/2579) spt-daemon dispatch::tests::only_the_old_broker_unknown_verb_answer_falls_back_to_the_peek
2026-08-18T01:31:12.5477818Z         PASS [   0.277s] ( 784/2579) spt::bin/spt api::startup::tests::the_pid_role_is_stamped_from_the_entry_path
2026-08-18T01:31:12.5565815Z         PASS [   0.261s] ( 785/2579) spt-daemon dispatch::tests::seat_blocked_requeues_budget_free_paced_by_the_breaker_window
2026-08-18T01:31:12.5660773Z         PASS [   0.198s] ( 786/2579) spt-daemon dispatch::tests::the_family_census_is_bijective_with_the_enum
2026-08-18T01:31:12.5661535Z         PASS [   0.128s] ( 787/2579) spt-daemon dispatch::tests::the_family_census_knows_about_the_answer_receipt
2026-08-18T01:31:12.6119273Z         PASS [   0.136s] ( 788/2579) spt-daemon dispatch::tests::transient_failure_requeues_bounded_and_terminal_never_reenters
2026-08-18T01:31:12.6342375Z         PASS [   0.147s] ( 789/2579) spt-daemon dispatch::tests::unknown_shapes_refuse_classification
2026-08-18T01:31:12.6449790Z         PASS [   0.156s] ( 790/2579) spt-daemon docshost::tests::content_types_cover_the_bundle_classes
2026-08-18T01:31:12.6645213Z         PASS [   0.172s] ( 791/2579) spt-daemon docshost::tests::port_resolution_env_config_default
2026-08-18T01:31:12.6647834Z         PASS [   0.171s] ( 792/2579) spt-daemon drivehub::tests::a_following_op_is_served_when_nothing_refused
2026-08-18T01:31:12.6648659Z         PASS [   0.182s] ( 793/2579) spt-daemon docshost::tests::sanitizer_admits_pages_and_rejects_escapes
2026-08-18T01:31:12.6725819Z         PASS [   0.166s] ( 794/2579) spt-daemon drivehub::tests::a_foreign_owlery_is_refused_pre_ack_under_its_own_name
2026-08-18T01:31:12.6930121Z         PASS [   0.216s] ( 795/2579) spt-daemon dispatch::tests::the_receiver_decides_origin_and_flood_not_the_sender
2026-08-18T01:31:12.7000481Z         PASS [   0.129s] ( 796/2579) spt-daemon drivehub::tests::an_unknown_op_hangs_up_instead_of_being_swallowed
2026-08-18T01:31:12.7004341Z         PASS [   0.150s] ( 797/2579) spt-daemon drivehub::tests::activity_and_drive_never_clobber_each_other
2026-08-18T01:31:12.7004982Z         PASS [   0.088s] ( 798/2579) spt-daemon drivehub::tests::clear_evicts_the_slot
2026-08-18T01:31:12.7111811Z         PASS [   0.145s] ( 799/2579) spt-daemon drivehub::tests::clear_evicts_both_classes
2026-08-18T01:31:12.7195580Z         PASS [   0.163s] ( 800/2579) spt-daemon drivehub::tests::activity_take_is_latest_wins_and_exactly_once
2026-08-18T01:31:12.7303988Z         PASS [   0.109s] ( 801/2579) spt-daemon drivehub::tests::dead_generation_activity_frame_is_never_served
2026-08-18T01:31:12.7340637Z         PASS [   0.079s] ( 802/2579) spt-daemon drivehub::tests::only_a_pre_ack_refusal_permits_a_second_spawn
2026-08-18T01:31:12.7349796Z         PASS [   0.086s] ( 803/2579) spt-daemon drivehub::tests::drive_result_activity_key_is_additive_on_the_wire
2026-08-18T01:31:12.7367833Z         PASS [   0.105s] ( 804/2579) spt-daemon drivehub::tests::dead_generation_frame_is_never_served
2026-08-18T01:31:12.7394367Z         PASS [   0.078s] ( 805/2579) spt-daemon drivehub::tests::slots_are_per_owner
2026-08-18T01:31:12.7539805Z         PASS [   0.206s] ( 806/2579) spt::bin/spt api::startup::tests::valid_seed_binds_live_perch
2026-08-18T01:31:12.8257843Z         PASS [   0.155s] ( 807/2579) spt-daemon drivehub::tests::take_is_exactly_once
2026-08-18T01:31:12.8489099Z         PASS [   0.154s] ( 808/2579) spt-daemon drivehub::tests::write_is_latest_wins
2026-08-18T01:31:12.8655843Z         PASS [   0.154s] ( 809/2579) spt-daemon effect::tests::apply_once_does_not_hold_the_journal_lock_across_effect
2026-08-18T01:31:12.8656612Z         PASS [   0.128s] ( 810/2579) spt-daemon effect::tests::minter_tag_round_trips
2026-08-18T01:31:12.8657177Z         PASS [   0.187s] ( 811/2579) spt-daemon drivehub::tests::the_launch_reply_shapes_round_trip
2026-08-18T01:31:12.8723407Z         PASS [   0.139s] ( 812/2579) spt-daemon effect::tests::marker_is_single_source_and_frozen
2026-08-18T01:31:13.0719817Z         PASS [   0.341s] ( 813/2579) spt-daemon effect::tests::failed_effect_is_not_recorded_applied
2026-08-18T01:31:13.0727635Z         PASS [   0.373s] ( 814/2579) spt-daemon effect::tests::applied_set_survives_reopen
2026-08-18T01:31:13.0896397Z         PASS [   0.346s] ( 815/2579) spt-daemon effect::tests::open_creates_missing_parent_dirs
2026-08-18T01:31:13.1366140Z         PASS [   0.272s] ( 816/2579) spt-daemon effect::tests::second_apply_for_same_key_is_deduped
2026-08-18T01:31:13.8567137Z         PASS [   1.152s] ( 817/2579) spt-daemon drivehub::tests::the_pre_ack_causes_are_three_distinct_diagnostics
2026-08-18T01:31:13.8568057Z         PASS [   0.985s] ( 818/2579) spt-daemon effect::tests::recover_is_migration_free
2026-08-18T01:31:13.9130448Z         PASS [   1.035s] ( 819/2579) spt-daemon effect::tests::with_tracing_retry_no_retry_on_success
2026-08-18T01:31:13.9131298Z         PASS [   0.840s] ( 820/2579) spt-daemon effect::tests::with_tracing_retry_passes_through_other_errors
2026-08-18T01:31:13.9824751Z         PASS [   0.910s] ( 821/2579) spt-daemon effect::tests::with_tracing_retry_retries_once_on_no_longer_held
2026-08-18T01:31:13.9880700Z         PASS [   0.903s] ( 822/2579) spt-daemon effect::tests::with_tracing_retry_terminal_is_public_language
2026-08-18T01:31:14.0227308Z         PASS [   0.886s] ( 823/2579) spt-daemon failedaddr::tests::a_null_address_records_nothing
2026-08-18T01:31:14.0308581Z         PASS [   0.181s] ( 824/2579) spt-daemon failedaddr::tests::an_expired_record_stops_matching_and_is_swept
2026-08-18T01:31:14.0309365Z         PASS [   0.186s] ( 825/2579) spt-daemon failedaddr::tests::a_successful_dial_clears_the_record
2026-08-18T01:31:14.0362548Z         PASS [   0.129s] ( 826/2579) spt-daemon failedaddr::tests::connecting_to_a_peer_clears_only_that_peers_records
2026-08-18T01:31:14.0405695Z         PASS [   0.129s] ( 827/2579) spt-daemon failedaddr::tests::matches_the_exact_address_and_no_other
2026-08-18T01:31:14.0484319Z         PASS [   0.066s] ( 828/2579) spt-daemon firewall::tests::a_deny_line_naming_the_port_does_not_admit_it
2026-08-18T01:31:14.0533639Z         PASS [   0.065s] ( 829/2579) spt-daemon firewall::tests::a_disabled_manager_does_not_shadow_the_backend
2026-08-18T01:31:14.1090769Z         PASS [   0.086s] ( 830/2579) spt-daemon firewall::tests::a_live_manager_outranks_its_backend
2026-08-18T01:31:14.1159930Z         PASS [   0.086s] ( 831/2579) spt-daemon firewall::tests::active_ufw_is_decided_against_the_bound_port
2026-08-18T01:31:14.1206596Z         PASS [   0.090s] ( 832/2579) spt-daemon firewall::tests::active_but_unreadable_is_unverified_not_a_verdict
2026-08-18T01:31:14.1248945Z         PASS [   0.089s] ( 833/2579) spt-daemon firewall::tests::any_rule_of_the_name_admitting_the_binder_passes
2026-08-18T01:31:14.1304502Z         PASS [   0.090s] ( 834/2579) spt-daemon firewall::tests::no_active_firewall_reads_unknown_and_inactive_ones_are_skipped
2026-08-18T01:31:14.1353662Z         PASS [   0.087s] ( 835/2579) spt-daemon firewall::tests::rule_for_another_binary_is_a_mismatch_not_a_pass
2026-08-18T01:31:14.1403334Z         PASS [   0.087s] ( 836/2579) spt-daemon firewall::tests::rule_for_the_binder_passes_regardless_of_case_or_separators
2026-08-18T01:31:14.1469157Z         PASS [   0.037s] ( 837/2579) spt-daemon firewall::tests::unanswerable_probes_read_unknown_and_no_rule_reads_missing
2026-08-18T01:31:14.1535829Z         PASS [   0.038s] ( 838/2579) spt-daemon forkop::tests::forking_into_the_reserved_id_is_refused_before_the_mind_is_copied
2026-08-18T01:31:14.1607022Z         PASS [   0.039s] ( 839/2579) spt-daemon frame::tests::envelope_with_unknown_trailing_field_decodes_on_older_peer
2026-08-18T01:31:14.1687619Z         PASS [   0.044s] ( 840/2579) spt-daemon frame::tests::handshake_accepts_newer_brain_on_older_broker
2026-08-18T01:31:14.1725660Z         PASS [   0.042s] ( 841/2579) spt-daemon frame::tests::handshake_rejects_below_floor
2026-08-18T01:31:14.1772097Z         PASS [   0.042s] ( 842/2579) spt-daemon frame::tests::handshake_rejects_role_mismatch
2026-08-18T01:31:14.2624691Z         PASS [   0.096s] ( 843/2579) spt-daemon frame::tests::unknown_kind_is_not_a_decode_error
2026-08-18T01:31:14.2656019Z         PASS [   0.109s] ( 844/2579) spt-daemon grants::tests::escalation_answers_apply
2026-08-18T01:31:14.2944413Z         PASS [   0.122s] ( 845/2579) spt-daemon grants::tests::no_session_escalates_with_none_target
2026-08-18T01:31:14.2945458Z         PASS [   0.138s] ( 846/2579) spt-daemon grants::tests::escalation_ask_body_roundtrip
2026-08-18T01:31:14.3004904Z         PASS [   0.123s] ( 847/2579) spt-daemon grants::tests::reserved_capabilities_refuse_even_when_granted
2026-08-18T01:31:14.3026289Z         PASS [   0.130s] ( 848/2579) spt-daemon grants::tests::preconsent_flags_author_grants
2026-08-18T01:31:14.3051613Z         PASS [   0.069s] ( 849/2579) spt-daemon grants::tests::ungranted_escalates_granted_allows
2026-08-18T01:31:14.3080072Z         PASS [   0.053s] ( 850/2579) spt-daemon harnesshost::tests::mint_session_id_is_fresh_hex
2026-08-18T01:31:15.7432452Z         PASS [   1.432s] ( 851/2579) spt-daemon harnesshost::tests::node_missing_reference_fails_loud
2026-08-18T01:31:15.7433264Z         PASS [   3.267s] ( 852/2579) spt-daemon dispatch::tests::the_relay_observation_is_a_real_connect_and_a_gone_listener_never_reads_offline
2026-08-18T01:31:15.7490182Z         PASS [   1.444s] ( 853/2579) spt-daemon harnesshost::tests::node_key_fills_advertised_label_in_session_template
2026-08-18T01:31:15.7594199Z         PASS [   1.454s] ( 854/2579) spt-daemon harnesshost::tests::prepare_fails_closed_on_wrong_kind_missing_role_and_bad_template
2026-08-18T01:31:15.7805582Z         PASS [   1.471s] ( 855/2579) spt-daemon harnesshost::tests::prepare_fills_id_and_session_into_self_command
2026-08-18T01:31:15.7870811Z         PASS [   1.479s] ( 856/2579) spt-daemon harnesshost::tests::prepare_resume_falls_back_to_self_when_no_resume_role
2026-08-18T01:31:15.7904351Z         PASS [   0.068s] ( 857/2579) spt-daemon harnesshost::tests::prepare_selects_resume_template_on_resume_else_self
2026-08-18T01:31:15.8502628Z         PASS [   1.538s] ( 858/2579) spt-daemon harnesshost::tests::prepare_fills_env_inject_values_with_substitution
2026-08-18T01:31:15.8506558Z         PASS [   0.112s] ( 859/2579) spt-daemon harnesshost::tests::prepare_threads_translation_binary_when_declared
2026-08-18T01:31:15.8660817Z         PASS [   0.128s] ( 860/2579) spt-daemon harnesshost::tests::provisional_session_id_recognizes_own_mint_only
2026-08-18T01:31:17.6545907Z         PASS [   1.855s] ( 861/2579) spt-daemon knocknotif::tests::correlation_subnet_beats_first_visible
2026-08-18T01:31:17.6559978Z         PASS [   1.892s] ( 862/2579) spt-daemon harnesshost::tests::translation_binary_resolves_against_install_dir
2026-08-18T01:31:17.6894359Z         PASS [   1.843s] ( 863/2579) spt-daemon knocknotif::tests::courtesy_subnet_is_a_member_subnet
2026-08-18T01:31:17.7602320Z         PASS [   1.888s] ( 864/2579) spt-daemon knocknotif::tests::hidden_addressee_is_not_a_candidate
2026-08-18T01:31:23.2721770Z         PASS [  10.446s] ( 865/2579) spt-daemon effect::tests::poisoned_journal_lock_still_applies_subsequent_ops
2026-08-18T01:31:23.2750194Z         PASS [  10.425s] ( 866/2579) spt-daemon effect::tests::ptywrite_skips_the_durable_journal_write_while_netsend_persists
2026-08-18T01:31:23.2972311Z         PASS [  10.425s] ( 867/2579) spt-daemon effect::tests::shellchan_and_rc_same_session_dont_collide
2026-08-18T01:31:30.1417236Z         PASS [  12.408s] ( 868/2579) spt-daemon lifecycle::tests::base_keys_carries_single_subnet_no_home
2026-08-18T01:31:37.8883843Z         PASS [  25.169s] ( 869/2579) spt-daemon effect::tests::each_named_minter_namespaces_its_ops
2026-08-18T01:31:38.0020394Z         PASS [  41.942s] ( 870/2579) spt::bin/spt cli::tests::owner_shutdown_gated_by_can_shutdown_grant
2026-08-18T01:31:38.2628563Z         PASS [  14.967s] ( 871/2579) spt-daemon lifecycle::tests::custody_survives_parent_boundary_and_reseed_clears
2026-08-18T01:31:38.2629320Z         PASS [  25.530s] ( 872/2579) spt-daemon effect::tests::gauntlet_is_exactly_once_across_brain_crashes
2026-08-18T01:31:38.2706290Z         PASS [  22.407s] ( 873/2579) spt-daemon lifecycle::tests::a_seeded_ingest_fault_survives_a_turn_success_after_a_restart
2026-08-18T01:31:38.2849851Z         PASS [  20.598s] ( 874/2579) spt-daemon lifecycle::tests::any_kind_success_clears_timeouts_but_only_its_own_hard_counter
2026-08-18T01:31:38.3131746Z         PASS [  20.645s] ( 875/2579) spt-daemon lifecycle::tests::a_slotless_stamp_seeds_nothing_and_an_unknown_slot_is_ignored
2026-08-18T01:31:38.3171344Z         PASS [  15.047s] ( 876/2579) spt-daemon lifecycle::tests::crash_signoff_spares_recovered_self
2026-08-18T01:31:38.3218633Z         PASS [   0.433s] ( 877/2579) spt-daemon lifecycle::tests::echo_fire_skips_loud_on_relative_dir_without_cwd
2026-08-18T01:31:38.3845635Z         PASS [  15.110s] ( 878/2579) spt-daemon lifecycle::tests::crash_signoff_tears_down_when_still_gone
2026-08-18T01:31:38.4297728Z         PASS [   0.152s] ( 879/2579) spt-daemon lifecycle::tests::first_turn_psyche_context_is_never_empty
2026-08-18T01:31:38.4298572Z         PASS [   8.273s] ( 880/2579) spt-daemon lifecycle::tests::echo_fire_resolves_relative_commune_dir_against_endpoint_cwd
2026-08-18T01:31:38.4300539Z         PASS [   0.168s] ( 881/2579) spt-daemon lifecycle::tests::event_turn_bound_follows_the_role_not_the_pulse
2026-08-18T01:31:38.4705452Z         PASS [  22.689s] ( 882/2579) spt-daemon inject::tests::has_parked_idle_spool_gates_on_idle_hosted_and_pending
2026-08-18T01:31:38.5884552Z         PASS [   0.235s] ( 883/2579) spt-daemon lifecycle::tests::harness_owner_gone_anchors_on_parent_pid
2026-08-18T01:31:38.5885454Z         PASS [  22.719s] ( 884/2579) spt-daemon inject::tests::shared_inject_leg_detects_spt_hosted
2026-08-18T01:31:38.5886114Z         PASS [  24.346s] ( 885/2579) spt-daemon grants::tests::escalation_notif_fires_to_most_recent_and_roundtrips
2026-08-18T01:31:38.5886747Z         PASS [   0.215s] ( 886/2579) spt-daemon lifecycle::tests::is_owlery_internal_cases
2026-08-18T01:31:38.5887565Z         PASS [   0.190s] ( 887/2579) spt-daemon lifecycle::tests::node_key_fills_advertised_label_in_lifecycle_base_keys
2026-08-18T01:31:38.5888611Z         PASS [   0.294s] ( 888/2579) spt-daemon lifecycle::tests::ingest_hard_failures_stamp_even_while_turns_succeed
2026-08-18T01:31:38.6687985Z         PASS [   0.281s] ( 889/2579) spt-daemon lifecycle::tests::manifest_cell_refresh_swaps_manifest_and_runtime
2026-08-18T01:31:38.6689073Z         PASS [   0.209s] ( 890/2579) spt-daemon lifecycle::tests::outcome_names_its_leg_and_turn_failure_wins
2026-08-18T01:31:38.6814601Z         PASS [   0.185s] ( 891/2579) spt-daemon lifecycle::tests::psyche_context_file_continue_is_zero_bytes_fresh_is_nonempty
2026-08-18T01:31:38.6844085Z         PASS [   0.270s] ( 892/2579) spt-daemon lifecycle::tests::orphan_watch_honors_stop_for_live_owner
2026-08-18T01:31:38.6888790Z         PASS [   0.273s] ( 893/2579) spt-daemon lifecycle::tests::outcome_classifies_by_type_never_by_message
2026-08-18T01:31:38.6890228Z         PASS [   0.183s] ( 894/2579) spt-daemon lifecycle::tests::psyche_turn_keys_carry_custody_sids_and_context_file_path
2026-08-18T01:31:38.8018951Z         PASS [   0.294s] ( 895/2579) spt-daemon lifecycle::tests::pulse_loop_does_not_write_anchor_per_fire
2026-08-18T01:31:38.8101495Z         PASS [   0.298s] ( 896/2579) spt-daemon lifecycle::tests::psyche_turn_strikes_exhausted_boundary
2026-08-18T01:31:38.8919308Z         PASS [   0.207s] ( 897/2579) spt-daemon lifecycle::tests::reload_fires_on_disk_change
2026-08-18T01:31:38.8957100Z         PASS [   0.095s] ( 898/2579) spt-daemon lifecycle::tests::reload_noop_without_install_dir
2026-08-18T01:31:38.9358483Z         PASS [   0.402s] ( 899/2579) spt-daemon lifecycle::tests::pulse_loop_is_config_paced_and_killable
2026-08-18T01:31:38.9671447Z         PASS [   0.274s] ( 900/2579) spt-daemon lifecycle::tests::reload_noop_when_unchanged
2026-08-18T01:31:38.9672124Z         PASS [   0.385s] ( 901/2579) spt-daemon lifecycle::tests::pulse_loop_update_preserves_phase_crash_rebases
2026-08-18T01:31:38.9858383Z         PASS [   0.166s] ( 902/2579) spt-daemon lifecycle::tests::resolve_endpoint_drop_dir_cases
2026-08-18T01:31:39.0167411Z         PASS [   0.418s] ( 903/2579) spt-daemon lifecycle::tests::pulse_recency_and_auto_suspend_follow_resting_state
2026-08-18T01:31:39.0168234Z         PASS [   0.328s] ( 904/2579) spt-daemon lifecycle::tests::reload_keeps_last_good_on_unparseable
2026-08-18T01:31:39.0835622Z         PASS [   0.121s] ( 905/2579) spt-daemon lifecycle::tests::session_not_found_discriminates_reseed_from_strike
2026-08-18T01:31:39.1383426Z         PASS [   0.622s] ( 906/2579) spt-daemon lifecycle::tests::psyche_turn_threads_parent_read_env_into_spawn
2026-08-18T01:31:39.2469898Z         PASS [  44.363s] ( 907/2579) spt::bin/spt cli::tests::fork_forks_homes_and_deletes_exactly_the_source
2026-08-18T01:31:39.2906133Z         PASS [   0.877s] ( 908/2579) spt-daemon lifecycle::tests::orphan_watch_fires_on_dead_owner
2026-08-18T01:31:39.3345714Z         PASS [   0.196s] ( 909/2579) spt-daemon linkhost::tests::force_on_an_offline_instance_is_the_plain_relink
2026-08-18T01:31:39.3346522Z         PASS [   0.318s] ( 910/2579) spt-daemon lifecycle::tests::turn_budget_stamps_on_exhaustion_and_clears_on_success
2026-08-18T01:31:39.3742107Z         PASS [   0.412s] ( 911/2579) spt-daemon lifecycle::tests::the_expectation_is_recorded_before_the_spawn_not_after
2026-08-18T01:31:39.3897406Z         PASS [   0.062s] ( 912/2579) spt-daemon linkhost::tests::per_capability_act_gate_blocks_until_class_scoped_grant
2026-08-18T01:31:39.3918811Z         PASS [   0.375s] ( 913/2579) spt-daemon lifecycle::tests::timeout_budget_is_ten_deep_not_three
2026-08-18T01:31:39.4842049Z         PASS [   0.576s] ( 914/2579) spt-daemon lifecycle::tests::rest_edge_echo_success_clears_stale_psyche_stamp
2026-08-18T01:31:39.4843149Z         PASS [   0.243s] ( 915/2579) spt-daemon linkhost::tests::force_refuses_an_ephemeral_instance_and_moves_nothing
2026-08-18T01:31:39.5329128Z         PASS [   0.526s] ( 916/2579) spt-daemon lifecycle::tests::thrash_budget_trips_on_a_synthetic_failure_loop_without_touching_status
2026-08-18T01:31:39.5946794Z         PASS [   0.475s] ( 917/2579) spt-daemon linkhost::tests::cmd_wakes_a_stale_online_persistent_instance
2026-08-18T01:31:39.5947594Z         PASS [  26.804s] ( 918/2579) spt::bin/spt rc::tests::attach_viewport_reconnects_across_a_broker_bounce
2026-08-18T01:31:39.6468561Z         PASS [   0.293s] ( 919/2579) spt-daemon linkhost::tests::prepare_drive_is_live_or_drop_and_never_spools
2026-08-18T01:31:39.6470239Z         PASS [   0.241s] ( 920/2579) spt-daemon linkhost::tests::run_action_honors_the_force_arg
2026-08-18T01:31:39.6472979Z         PASS [   0.248s] ( 921/2579) spt-daemon linkhost::tests::run_action_drive_drops_offline_without_wake_or_spool
2026-08-18T01:31:39.6473803Z         PASS [   0.384s] ( 922/2579) spt-daemon linkhost::tests::gateway_typed_owner_resolves_and_drives_keyed_on_id_not_type
2026-08-18T01:31:39.6580202Z         PASS [   0.755s] ( 923/2579) spt-daemon lifecycle::tests::rest_event_fires_echo_once_and_wake_resurfaces
2026-08-18T01:31:39.6580868Z         PASS [   0.091s] ( 924/2579) spt-daemon machineid::tests::hash_is_domain_separated_and_stable
2026-08-18T01:31:39.6628338Z         PASS [   0.103s] ( 925/2579) spt::bin/spt rc::tests::broker_host_child
2026-08-18T01:31:39.6677495Z         PASS [   0.172s] ( 926/2579) spt-daemon linkhost::tests::survivor_probe_separates_our_binary_from_a_recycled_pid
2026-08-18T01:31:39.7243807Z         PASS [   0.343s] ( 927/2579) spt-daemon linkhost::tests::relink_refuses_a_live_instance_but_recovers_a_stale_online_one
2026-08-18T01:31:39.8652889Z         PASS [   0.282s] ( 928/2579) spt-daemon linkhost::tests::run_action_refuses_gated_op_without_spooling
2026-08-18T01:31:39.8654265Z         PASS [   0.135s] ( 929/2579) spt-daemon machineid::tests::machine_id_hash_resolves_and_is_stable
2026-08-18T01:31:39.8669699Z         PASS [   0.349s] ( 930/2579) spt-daemon linkhost::tests::run_action_relinks_drives_and_refuses
2026-08-18T01:31:39.9492707Z         PASS [   0.315s] ( 931/2579) spt-daemon msg::tests::bytes_round_trip_through_payload
2026-08-18T01:31:40.0995875Z         PASS [   0.343s] ( 932/2579) spt-daemon msg::tests::output_envelope_round_trips
2026-08-18T01:31:40.0996456Z         PASS [   0.446s] ( 933/2579) spt-daemon msg::tests::evicted_envelope_round_trips
2026-08-18T01:31:40.1024428Z         PASS [   0.267s] ( 934/2579) spt-daemon msg::tests::presence_event_round_trips_and_tolerates_future_kind
2026-08-18T01:31:40.1025150Z         PASS [   0.446s] ( 935/2579) spt-daemon msg::tests::input_req_absent_ack_defaults_true_n_minus_1_safe
2026-08-18T01:31:40.1218768Z         PASS [   0.390s] ( 936/2579) spt-daemon msg::tests::net_frames_round_trip_and_tolerate_unknown_fields
2026-08-18T01:31:40.1219455Z         PASS [   0.464s] ( 937/2579) spt-daemon msg::tests::endpoint_input_frames_round_trip
2026-08-18T01:31:40.1223554Z         PASS [   0.346s] ( 938/2579) spt-daemon msg::tests::output_sync_flag_defaults_absent_and_skips_when_false
2026-08-18T01:31:40.1351791Z         PASS [   0.474s] ( 939/2579) spt-daemon msg::tests::endpoint_injected_envelope_carries_delivered_and_spool_hint
2026-08-18T01:31:40.1457255Z         PASS [   0.467s] ( 940/2579) spt-daemon msg::tests::input_req_ack_false_round_trips_faithfully
2026-08-18T01:31:40.2064158Z         PASS [   0.250s] ( 941/2579) spt-daemon msg::tests::spawn_req_tolerates_unknown_field
2026-08-18T01:31:40.2211647Z         PASS [   0.124s] ( 942/2579) spt-daemon msg::tests::two_phase_join_wire_round_trips
2026-08-18T01:31:40.2227024Z         PASS [   0.125s] ( 943/2579) spt-daemon msg::tests::wire_decodes_old_shape_to_legacy
2026-08-18T01:31:40.2347089Z         PASS [   0.140s] ( 944/2579) spt-daemon msg::tests::stream_lifetime_is_additive_and_defaults_durable
2026-08-18T01:31:40.4216520Z         PASS [   0.189s] ( 945/2579) spt-daemon nethost::tests::home_relay_reads_a_real_serialized_endpoint_addr
2026-08-18T01:31:40.4217203Z         PASS [   1.501s] ( 946/2579) spt-daemon lifecycle::tests::role_less_manifest_ticks_strike_free
2026-08-18T01:31:40.4497330Z         PASS [   0.337s] ( 947/2579) spt-daemon nethost::tests::begin_attach_refuses_only_while_a_poisoned_prior_still_drains
2026-08-18T01:31:40.4539403Z         PASS [   0.319s] ( 948/2579) spt-daemon nethost::tests::dispatch_stream_infos_excludes_local_and_retired_rows_server_side
2026-08-18T01:31:40.4739774Z         PASS [   0.363s] ( 949/2579) spt-daemon nethost::tests::bounded_block_on_cuts_a_never_completing_op_with_an_ordinary_error
2026-08-18T01:31:40.4872981Z         PASS [   0.385s] ( 950/2579) spt-daemon nethost::tests::append_halts_at_first_failed_write_removes_the_seat_and_cancels_the_lease
2026-08-18T01:31:40.4949184Z         PASS [   0.385s] ( 951/2579) spt-daemon nethost::tests::attach_replay_never_interleaves_with_concurrent_live_appends
2026-08-18T01:31:40.5812934Z         PASS [   0.300s] ( 952/2579) spt-daemon nethost::tests::finish_halts_and_removes_a_poisoned_seat
2026-08-18T01:31:40.5829768Z         PASS [   0.356s] ( 953/2579) spt-daemon nethost::tests::displaced_writer_failure_never_cancels_the_successor_lease
2026-08-18T01:31:40.6751756Z         PASS [   0.436s] ( 954/2579) spt-daemon nethost::tests::host_binds_endpoint_to_node_identity
2026-08-18T01:31:40.7053348Z         PASS [   0.197s] ( 955/2579) spt-daemon nethost::tests::opener_capture_gives_up_bounded_on_a_newline_less_stream
2026-08-18T01:31:40.7075352Z         PASS [   0.287s] ( 956/2579) spt-daemon nethost::tests::loopback_conn_is_a_reused_singleton_that_cross_wires_a_stream_pair
2026-08-18T01:31:40.7424546Z         PASS [   0.229s] ( 957/2579) spt-daemon nethost::tests::opener_pins_first_line_across_full_ring_roll
2026-08-18T01:31:40.7425236Z         PASS [   0.293s] ( 958/2579) spt-daemon nethost::tests::next_seq_counts_appends_not_logical_chunks
2026-08-18T01:31:40.7447346Z         PASS [   0.273s] ( 959/2579) spt-daemon nethost::tests::open_class_routes_to_the_opener_row_only
2026-08-18T01:31:40.8168802Z         PASS [   0.363s] ( 960/2579) spt-daemon nethost::tests::op_maps_are_minter_namespaced
2026-08-18T01:31:40.8879618Z         PASS [   0.308s] ( 961/2579) spt-daemon nethost::tests::presence_log_mirrors_the_seat_discipline
2026-08-18T01:31:40.8880375Z         PASS [   0.206s] ( 962/2579) spt-daemon nethost::tests::retentive_log_is_lossless_ordered_while_ordinary_log_overwrites
2026-08-18T01:31:40.8922805Z         PASS [   0.371s] ( 963/2579) spt-daemon nethost::tests::overflow_detaches_without_lease_cancel_and_the_brain_resumes_from_cursor
2026-08-18T01:31:41.0582079Z         PASS [   0.303s] ( 964/2579) spt-daemon nethost::tests::retire_hides_the_row_while_active_rows_stay
2026-08-18T01:31:41.0582841Z         PASS [   0.281s] ( 965/2579) spt-daemon nethost::tests::retired_row_still_flushes_a_late_reply
2026-08-18T01:31:41.0584345Z         PASS [   0.278s] ( 966/2579) spt-daemon nethost::tests::send_stream_refuses_on_a_canceled_lease
2026-08-18T01:31:41.0591410Z         PASS [   0.361s] ( 967/2579) spt-daemon nethost::tests::retire_sweep_dismisses_the_seat_and_terminal_retire_drops_the_row
2026-08-18T01:31:41.1087834Z         PASS [   0.364s] ( 968/2579) spt-daemon nethost::tests::two_hosts_dial_over_loopback
2026-08-18T01:31:41.1138097Z         PASS [   1.003s] ( 969/2579) spt-daemon nethost::tests::conn_close_sweeps_its_stream_rows
2026-08-18T01:31:41.1478500Z         PASS [   0.329s] ( 970/2579) spt-daemon nethost::tests::unsubscribe_releases_only_the_callers_seat_joins_writer_and_is_idempotent
2026-08-18T01:31:41.5429818Z         PASS [   0.539s] ( 971/2579) spt-daemon notif::tests::expired_row_is_auto_dismissed_at_boundary_not_surfaced
2026-08-18T01:31:41.5434775Z         PASS [   0.666s] ( 972/2579) spt-daemon notif::tests::an_absent_addressee_yields_no_target_rather_than_the_mra_winner
2026-08-18T01:31:41.5438153Z         PASS [   0.680s] ( 973/2579) spt-daemon notif::tests::a_boundary_surfaces_an_addressed_row_only_at_its_addressee
2026-08-18T01:31:41.6831343Z         PASS [   0.665s] ( 974/2579) spt-daemon notif::tests::first_fire_declines_an_already_expired_row
2026-08-18T01:31:41.6899407Z         PASS [   0.708s] ( 975/2579) spt-daemon notif::tests::consent_decision_produces_notif_only_when_gated
2026-08-18T01:31:41.8082532Z         PASS [   0.668s] ( 976/2579) spt-daemon notif::tests::first_fire_rides_the_quiet_window_not_the_live_stream
2026-08-18T01:31:41.8105388Z         PASS [   0.724s] ( 977/2579) spt-daemon notif::tests::first_fire_reaches_most_recent_visible_endpoint
2026-08-18T01:31:41.8106271Z         PASS [   0.637s] ( 978/2579) spt-daemon notif::tests::hidden_endpoint_boundary_surfaces_nothing
2026-08-18T01:31:41.8210237Z         PASS [   1.388s] ( 979/2579) spt-daemon nethost::tests::loopback_tunnel_backpressures_without_loss
2026-08-18T01:31:41.8359761Z         PASS [   0.727s] ( 980/2579) spt-daemon notif::tests::first_fire_redirects_to_a_fresher_remote_winner_unmarked
2026-08-18T01:31:41.9570898Z         PASS [   0.404s] ( 981/2579) spt-daemon notif::tests::no_live_endpoint_is_a_typed_no_target
2026-08-18T01:31:41.9571914Z         PASS [   1.059s] ( 982/2579) spt-daemon notif::tests::an_addressed_row_fires_at_its_addressee_and_nowhere_else
2026-08-18T01:31:42.0087173Z         PASS [   0.316s] ( 983/2579) spt-daemon notif::tests::notif_command_renders_all_keys_and_is_opt_in
2026-08-18T01:31:42.0489543Z         PASS [   0.213s] ( 984/2579) spt-daemon notifgate::tests::distinct_notifs_both_deliver
2026-08-18T01:31:42.0490271Z         PASS [   0.246s] ( 985/2579) spt-daemon notifgate::tests::an_unvalidatable_notify_passes
2026-08-18T01:31:42.2316671Z         PASS [   0.625s] ( 986/2579) spt-daemon notif::tests::hidden_endpoint_is_never_the_target
2026-08-18T01:31:42.2993324Z         PASS [   0.720s] ( 987/2579) spt-daemon notif::tests::node_scoped_first_fire_ignores_a_fresher_remote_winner
2026-08-18T01:31:42.2994118Z         PASS [   0.347s] ( 988/2579) spt-daemon notifgate::tests::the_validity_gate_decision_table
2026-08-18T01:31:42.3812873Z         PASS [   0.397s] ( 989/2579) spt-daemon notifgate::tests::retain_preserves_order_of_the_survivors
2026-08-18T01:31:42.7693294Z         PASS [   1.079s] ( 990/2579) spt-daemon notif::tests::resurface_delivers_undismissed_with_gates
2026-08-18T01:31:42.7798230Z         PASS [   0.994s] ( 991/2579) spt-daemon notif::tests::shell_notif_templates_render_for_attached_instances_only
2026-08-18T01:31:42.7928331Z         PASS [   1.008s] ( 992/2579) spt-daemon notif::tests::rollback_notif_is_loud_and_resurfaces
2026-08-18T01:31:42.7929129Z         PASS [   0.491s] ( 993/2579) spt-daemon pairhost::tests::a_re_postured_subnet_advises_and_never_applies
2026-08-18T01:31:42.8098262Z         PASS [   0.041s] ( 994/2579) spt-daemon pairhost::tests::joiner_clock_render_shows_step_offset_and_state
2026-08-18T01:31:42.8143510Z         PASS [   0.037s] ( 995/2579) spt-daemon pairhost::tests::meet_failure_detail_concise_vs_verbose
2026-08-18T01:31:42.8940565Z         PASS [   0.106s] ( 996/2579) spt-daemon pairhost::tests::meet_final_retry_failing_surrenders_once
2026-08-18T01:31:42.8971762Z         PASS [   0.109s] ( 997/2579) spt-daemon pairhost::tests::meet_retries_once_after_refresh_on_exhaustion
2026-08-18T01:31:42.9316082Z         PASS [   0.928s] ( 998/2579) spt-daemon notifsync::tests::concurrent_dismiss_and_surface_commute_across_the_feed
2026-08-18T01:31:42.9440279Z         PASS [   0.889s] ( 999/2579) spt-daemon notifsync::tests::node_scoped_rows_are_excluded_from_the_feed
2026-08-18T01:31:42.9649465Z         PASS [   0.150s] (1000/2579) spt-daemon pairhost::tests::wire_errors_classify_for_the_guided_ux
2026-08-18T01:31:42.9653064Z         PASS [   0.155s] (1001/2579) spt-daemon pairhost::tests::the_advisory_says_nothing_was_applied
2026-08-18T01:31:43.0398263Z         PASS [   1.254s] (1002/2579) spt-daemon notif::tests::suppression_window_holds_cross_endpoint
2026-08-18T01:31:43.0776273Z         PASS [   0.149s] (1003/2579) spt-daemon presence::tests::snapshot_loading_degrades_on_junk
2026-08-18T01:31:43.0860689Z         PASS [   0.736s] (1004/2579) spt-daemon pairhost::tests::an_advisory_records_the_sighting_and_still_applies_nothing
2026-08-18T01:31:43.0861454Z         PASS [   0.191s] (1005/2579) spt-daemon presence::tests::mra_degrades_to_local_and_skips_noise_rows
2026-08-18T01:31:43.0862128Z         PASS [   0.120s] (1006/2579) spt-daemon projwriter::tests::cold_construct_spawns_no_git_and_first_cycle_publishes
2026-08-18T01:31:43.1243812Z         PASS [   0.227s] (1007/2579) spt-daemon presence::tests::mra_joins_local_and_gossiped_legs_under_one_max
2026-08-18T01:31:43.1375328Z         PASS [   1.088s] (1008/2579) spt-daemon notifsync::tests::feed_converges_two_stores_and_dismiss_replicates
2026-08-18T01:31:43.1380139Z         PASS [   0.199s] (1009/2579) spt-daemon presence::tests::subnet_scope_gates_both_legs
2026-08-18T01:31:43.1798147Z         PASS [   0.907s] (1010/2579) spt-daemon notifsync::tests::untrusted_and_cross_subnet_origins_are_dropped
2026-08-18T01:31:43.1799041Z         PASS [   1.002s] (1011/2579) spt-daemon notifsync::tests::non_member_subnet_record_never_materializes
2026-08-18T01:31:43.1836444Z         PASS [   0.146s] (1012/2579) spt-daemon projwriter::tests::corrupt_index_is_repaired_and_counted
2026-08-18T01:31:43.6715643Z         PASS [   0.489s] (1013/2579) spt-daemon propagate::tests::classifier_maps_every_status_shape
2026-08-18T01:31:44.5831052Z         PASS [   4.895s] (1014/2579) spt::bin/spt rc::tests::qualified_targets_attach_with_bare_wire_id
2026-08-18T01:31:44.5831859Z         PASS [   1.396s] (1015/2579) spt-daemon psyrelay::tests::empty_and_oversize_bodies_drop_typed
2026-08-18T01:31:44.5832523Z         PASS [   0.908s] (1016/2579) spt-daemon psyrelay::tests::notify_without_live_endpoint_is_pending
2026-08-18T01:31:44.6089996Z         PASS [   1.403s] (1017/2579) spt-daemon psyrelay::tests::notify_reaches_own_user_only
2026-08-18T01:31:44.6198637Z         PASS [   0.063s] (1018/2579) spt::bin/spt rc::tests::reconnect_class_only_severed_transport_redrives
2026-08-18T01:31:44.7025459Z         PASS [   0.080s] (1019/2579) spt::bin/spt wansend::tests::a_knock_reports_only_what_the_far_end_confirmed
2026-08-18T01:31:44.7274726Z         PASS [   1.651s] (1020/2579) spt-daemon projwriter::tests::cwd_invalidation_evicts_shared_cache_entry
2026-08-18T01:31:44.8506115Z         PASS [   0.149s] (1021/2579) spt::bin/spt wansend::tests::a_shared_short_key_refuses_and_an_unknown_one_is_its_own_outcome
2026-08-18T01:31:44.9931018Z         PASS [   0.134s] (1022/2579) spt::bin/spt wansend::tests::a_short_key_resolves_through_each_node_tier_carrier_alone
2026-08-18T01:31:45.0281284Z         PASS [   7.031s] (1023/2579) spt-daemon lifecycle::tests::empty_sweep_yields_no_outcome_while_a_real_ingest_yields_success
2026-08-18T01:31:45.0918560Z         PASS [   0.106s] (1024/2579) spt::bin/spt wansend::tests::an_explicit_override_outranks_the_ownership_scope
2026-08-18T01:31:45.2200676Z         PASS [   0.124s] (1025/2579) spt::bin/spt wansend::tests::an_unanswered_fork_is_unconfirmed_and_never_reported_as_done
2026-08-18T01:31:45.3244711Z         PASS [  27.568s] (1026/2579) spt-daemon lifecycle::tests::an_ingest_consumes_the_standing_expectation
2026-08-18T01:31:45.3245496Z         PASS [   0.696s] (1027/2579) spt-daemon psyrelay::tests::null_stdout_driver_fails_the_guard
2026-08-18T01:31:45.3483189Z         PASS [   0.702s] (1028/2579) spt-daemon psyrelay::tests::prose_only_relays_nothing
2026-08-18T01:31:45.3556388Z         PASS [   0.750s] (1029/2579) spt-daemon psyrelay::tests::reply_relays_to_inbound_sender
2026-08-18T01:31:45.4191685Z         PASS [   0.181s] (1030/2579) spt-daemon pump::health::tests::a_failing_peer_whose_node_the_registry_reports_offline_reads_absent_not_degraded
2026-08-18T01:31:45.4193152Z         PASS [   0.150s] (1031/2579) spt-daemon pump::health::tests::a_non_target_connection_never_counts_and_disconnects_mirror_the_conn_set
2026-08-18T01:31:45.4241984Z         PASS [   0.210s] (1032/2579) spt::bin/spt wansend::tests::bare_id_resolves_across_remote_snapshot
2026-08-18T01:31:45.4243039Z         PASS [   0.155s] (1033/2579) spt-daemon pump::health::tests::a_subnet_leave_re_derives_the_live_count_without_disconnecting_anybody
2026-08-18T01:31:45.4722906Z         PASS [   0.055s] (1034/2579) spt-daemon pump::health::tests::degraded_on_all_peer_failure_healthy_only_on_real_progress
2026-08-18T01:31:45.4724466Z         PASS [   0.041s] (1035/2579) spt::bin/spt wansend::tests::classify_wan_reply_only_delivers_on_positive_outcomes
2026-08-18T01:31:45.4892330Z         PASS [   0.068s] (1036/2579) spt-daemon pump::health::tests::five_of_seven_failing_behind_two_live_peers_is_degraded_partial_never_healthy
2026-08-18T01:31:45.4915035Z         PASS [   0.155s] (1037/2579) spt-daemon pump::health::tests::a_target_leaving_the_roster_drops_its_failure_and_can_return_the_node_to_green
2026-08-18T01:31:45.5047105Z         PASS [   0.080s] (1038/2579) spt-daemon pump::health::tests::health_file_roundtrip_and_degrade
2026-08-18T01:31:45.5208506Z         PASS [   0.069s] (1039/2579) spt-daemon pump::health::tests::one_peer_reconnecting_narrows_the_verdict_without_restarting_the_incident_clock
2026-08-18T01:31:45.5209760Z         PASS [   6.885s] (1040/2579) spt-daemon lifecycle::tests::pulse_tick_ingests_drop
2026-08-18T01:31:45.5225563Z         PASS [   0.058s] (1041/2579) spt::bin/spt wansend::tests::hide_new_reaches_this_nodes_ids_and_no_further
2026-08-18T01:31:45.5464236Z         PASS [   0.819s] (1042/2579) spt-daemon psyrelay::tests::reply_without_target_is_dropped
2026-08-18T01:31:45.5761532Z         PASS [   0.083s] (1043/2579) spt-daemon pump::health::tests::one_unaccounted_failing_peer_holds_the_degraded_partial_verdict
2026-08-18T01:31:45.6008964Z         PASS [   0.080s] (1044/2579) spt-daemon pump::health::tests::stage_parses_from_attributed_reasons
2026-08-18T01:31:45.6649220Z         PASS [   0.122s] (1045/2579) spt-daemon pump::health::tests::peers_absent_replaces_only_a_degraded_verdict_and_never_outlives_its_target
2026-08-18T01:31:45.6650338Z         PASS [   0.125s] (1046/2579) spt-daemon pump::health::tests::stale_gossip_forces_the_conservative_read_even_with_every_node_offline
2026-08-18T01:31:45.6651060Z         PASS [   0.132s] (1047/2579) spt::bin/spt wansend::tests::load_snapshots_degrades_on_junk
2026-08-18T01:31:45.6672416Z         PASS [   0.152s] (1048/2579) spt-daemon pump::health::tests::registry_admit_stamp_survives_restart_rounds_and_never_regresses
2026-08-18T01:31:45.7060066Z         PASS [   0.057s] (1049/2579) spt-daemon pump::registry::tests::poll_wake_takes_the_advertise_marker_exactly_once
2026-08-18T01:31:45.7311973Z         PASS [   0.183s] (1050/2579) spt-daemon pump::registry::tests::disclosable_lines_keeps_the_per_subnet_filter
2026-08-18T01:31:45.7984736Z         FAIL [   0.178s] (1051/2579) spt-daemon pump::registry::tests::discover_gate_filters_the_advert_push_per_viewer
2026-08-18T01:31:45.7985870Z   stdout ───
2026-08-18T01:31:45.7986272Z 
2026-08-18T01:31:45.7986348Z     running 1 test
2026-08-18T01:31:45.7986707Z     test pump::registry::tests::discover_gate_filters_the_advert_push_per_viewer ... FAILED
2026-08-18T01:31:45.7987058Z 
2026-08-18T01:31:45.7987131Z     failures:
2026-08-18T01:31:45.7987224Z 
2026-08-18T01:31:45.7987294Z     failures:
2026-08-18T01:31:45.7987571Z         pump::registry::tests::discover_gate_filters_the_advert_push_per_viewer
2026-08-18T01:31:45.7987866Z 
2026-08-18T01:31:45.7988132Z     test result: FAILED. 0 passed; 1 failed; 0 ignored; 0 measured; 843 filtered out; finished in 0.06s
2026-08-18T01:31:45.7988479Z 
2026-08-18T01:31:45.7988596Z   stderr ───
2026-08-18T01:31:45.7988698Z 
2026-08-18T01:31:45.7989169Z     thread 'pump::registry::tests::discover_gate_filters_the_advert_push_per_viewer' (49156) panicked at crates\spt-daemon\src\pump\registry.rs:369:13:
2026-08-18T01:31:45.7990238Z     refused viewer is not told the endpoint exists: {"subnet":"home","endpoint_id":"ling","instance":{"node":"me","status":"Active","epoch":1,"resources":"ling builds rust","bound":true}}
2026-08-18T01:31:45.7990835Z     {"subnet":"home","endpoint_id":"doyle","instance":{"node":"me","status":"Active","epoch":1,"resources":"doyle builds rust","bound":true}}
2026-08-18T01:31:45.7991206Z     {"subnet":"home","node":"me","label":"hfenduleam","epoch":1}
2026-08-18T01:31:45.7991357Z 
2026-08-18T01:31:45.7991718Z     note: run with `RUST_BACKTRACE=1` environment variable to display a backtrace
2026-08-18T01:31:45.7991948Z 
2026-08-18T01:31:45.7992074Z   Cancelling due to test failure: 15 tests still running
2026-08-18T01:31:45.8263069Z         PASS [   0.260s] (1052/2579) spt-daemon pump::registry::tests::disclosable_lines_pushes_the_engine_room_only_to_its_chosen_viewer
2026-08-18T01:31:45.9146889Z         PASS [   0.292s] (1053/2579) spt-daemon pump::registry::tests::fire_due_rotations_rotates_due_and_leaves_pending
2026-08-18T01:31:45.9386764Z         PASS [   0.283s] (1054/2579) spt::bin/spt wansend::tests::refusals_render_copy_paste_targets
2026-08-18T01:31:46.0806515Z         PASS [   0.329s] (1055/2579) spt-daemon pump::update::tests::the_retire_predicate_keeps_ahead_and_unparseable_rows
2026-08-18T01:31:46.0811790Z         PASS [   0.355s] (1056/2579) spt-daemon pump::update::tests::advertised_version_finds_dotted_tokens_and_refuses_counter_shapes
2026-08-18T01:31:46.0812743Z         PASS [   2.921s] (1057/2579) spt-daemon projwriter::tests::writer_thread_debounces_burst_into_one_cycle
2026-08-18T01:31:46.0813462Z         PASS [   1.036s] (1058/2579) spt-daemon psyrelay::tests::spoofed_routing_is_stripped_and_restamped
2026-08-18T01:31:46.1817283Z         PASS [   0.521s] (1059/2579) spt-daemon pump::registry::tests::pre_round_sweeps_and_refreshes_adverts_each_round
2026-08-18T01:31:46.5808207Z         PASS [   3.474s] (1060/2579) spt-daemon projwriter::tests::ordinary_commit_is_noop_config_change_rederives
2026-08-18T01:31:50.4169047Z         PASS [   7.331s] (1061/2579) spt-daemon projwriter::tests::endpoint_events_patch_rows_and_drop_purged
2026-08-18T01:31:50.4240760Z         PASS [   7.339s] (1062/2579) spt-daemon projwriter::tests::failed_cycle_preserves_last_known_good
2026-08-18T01:31:50.8284733Z         PASS [   7.691s] (1063/2579) spt-daemon projwriter::tests::warm_start_unchanged_generation_scans_nothing
2026-08-18T01:31:51.0512448Z         PASS [  12.388s] (1064/2579) spt-daemon lifecycle::tests::relative_commune_dir_resolves_against_endpoint_cwd_and_fills_project_branch
2026-08-18T01:31:54.6923183Z         PASS [  11.729s] (1065/2579) spt-daemon projwriter::tests::batched_complexity_counters_hold
2026-08-18T01:31:55.9379642Z         PASS [  12.814s] (1066/2579) spt-daemon projwriter::tests::parity_full_ordered_list_vs_legacy_oracle
2026-08-18T01:31:55.9390340Z ────────────
2026-08-18T01:31:55.9390742Z      Summary [  65.343s] 1066/2579 tests run: 1065 passed (1 leaky), 1 failed, 1 skipped
2026-08-18T01:31:55.9400915Z         FAIL [   0.178s] (1051/2579) spt-daemon pump::registry::tests::discover_gate_filters_the_advert_push_per_viewer
2026-08-18T01:31:55.9403802Z warning: 1513/2579 tests were not run due to test failure (run with --no-fail-fast to run all tests, or run with --max-fail)
2026-08-18T01:31:55.9508809Z error: test run failed
2026-08-18T01:31:56.0798828Z ##[error]Process completed with exit code 1.
2026-08-18T01:31:56.1389644Z Post job cleanup.
2026-08-18T01:31:57.0599019Z [command]"C:\Program Files\Git\cmd\git.exe" version
2026-08-18T01:31:57.2213756Z git version 2.43.0.windows.1
2026-08-18T01:31:57.2408108Z Copying 'C:\Users\decid\.gitconfig' to 'C:\actions-runner\_work\_temp\b03a8120-7c9b-4e60-bc61-c625d192b053\.gitconfig'
2026-08-18T01:31:57.2463167Z Temporarily overriding HOME='C:\actions-runner\_work\_temp\b03a8120-7c9b-4e60-bc61-c625d192b053' before making global git config changes
2026-08-18T01:31:57.2464285Z Adding repository directory to the temporary git global config as a safe directory
2026-08-18T01:31:57.2469822Z [command]"C:\Program Files\Git\cmd\git.exe" config --global --add safe.directory C:\actions-runner\_work\spt-bs-core\spt-bs-core
2026-08-18T01:31:57.3720717Z [command]"C:\Program Files\Git\cmd\git.exe" config --local --name-only --get-regexp core\.sshCommand
2026-08-18T01:31:57.4406782Z [command]"C:\Program Files\Git\cmd\git.exe" submodule foreach --recursive "sh -c \"git config --local --name-only --get-regexp 'core\.sshCommand' && git config --local --unset-all 'core.sshCommand' || :\""
2026-08-18T01:31:58.8579456Z [command]"C:\Program Files\Git\cmd\git.exe" config --local --name-only --get-regexp http\.https\:\/\/github\.com\/\.extraheader
2026-08-18T01:31:59.0074699Z http.https://github.com/.extraheader
2026-08-18T01:31:59.0176711Z [command]"C:\Program Files\Git\cmd\git.exe" config --local --unset-all http.https://github.com/.extraheader
2026-08-18T01:31:59.0725857Z [command]"C:\Program Files\Git\cmd\git.exe" submodule foreach --recursive "sh -c \"git config --local --name-only --get-regexp 'http\.https\:\/\/github\.com\/\.extraheader' && git config --local --unset-all 'http.https://github.com/.extraheader' || :\""
2026-08-18T01:32:00.0286244Z [command]"C:\Program Files\Git\cmd\git.exe" config --local --name-only --get-regexp ^includeIf\.gitdir:
2026-08-18T01:32:00.0621561Z [command]"C:\Program Files\Git\cmd\git.exe" submodule foreach --recursive "git config --local --show-origin --name-only --get-regexp remote.origin.url"
2026-08-18T01:32:00.7537368Z Cleaning up orphan processes
